[oVirt Jenkins] ovirt-system-tests_performance-suite-master - Build # 1521 - Still Failing!

Project: https://jenkins.ovirt.org/job/ovirt-system-tests_performance-suite-master/ Build: https://jenkins.ovirt.org/job/ovirt-system-tests_performance-suite-master/15... Build Number: 1521 Build Status: Still Failing Triggered By: Started by timer ------------------------------------- Changes Since Last Success: ------------------------------------- Changes for Build #1516 [Marcin Sobczyk] network: Run network suite master on el8 Changes for Build #1517 [Andrej Cernek] network, hostlib: refactor setup_networks method [Barak Korren] usrc: Support *.yml files Changes for Build #1518 [Galit] Remove basic-suite-4.2 suite Changes for Build #1519 [Marcin Sobczyk] basic: Verify glance template creation before tearing down the engine Changes for Build #1520 [Marcin Sobczyk] ost-images: Use OST images when available Changes for Build #1521 [Ehud Yonasi] fix el7 container label. [Roy Golan] Removing rgolan@redhat.com from email notifs ----------------- Failed Tests: ----------------- 1 tests failed. FAILED: 1000_analyze_postgresql.analyze_postgres Error Message: Failed to perform the postgres analysis. Exit code is 1 -------------------- >> begin captured logging << -------------------- lago.plugins.vm: INFO: * Copy /home/jenkins/agent/workspace/ovirt-system-tests_performance-suite-master/ovirt-system-tests/performance-suite-master/../common/test-scenarios-files/analyze_postgresql.sh to lago-performance-suite-master-engine:/root: ?[0m?[0m lago.ssh: DEBUG: start task:a9b6bf76-d6a4-4f6d-938d-59d14cc805d8:Get ssh client for lago-performance-suite-master-engine: lago.ssh: DEBUG: end task:a9b6bf76-d6a4-4f6d-938d-59d14cc805d8:Get ssh client for lago-performance-suite-master-engine: lago.plugins.vm: INFO: * Copy /home/jenkins/agent/workspace/ovirt-system-tests_performance-suite-master/ovirt-system-tests/performance-suite-master/../common/test-scenarios-files/analyze_postgresql.sh to lago-performance-suite-master-engine:/root: ?[32mSuccess?[0m (in 0:00:00) lago.ssh: DEBUG: start task:3cbcc980-918f-4be9-ac5e-e10f86305521:Get ssh client for lago-performance-suite-master-engine: lago.ssh: DEBUG: end task:3cbcc980-918f-4be9-ac5e-e10f86305521:Get ssh client for lago-performance-suite-master-engine: lago.ssh: DEBUG: Running aee507f2 on lago-performance-suite-master-engine: /root/analyze_postgresql.sh lago.ssh: DEBUG: Command aee507f2 on lago-performance-suite-master-engine returned with 1 lago.ssh: DEBUG: Command aee507f2 on lago-performance-suite-master-engine output: Last metadata expiration check: 0:11:06 ago on Thu 16 Jul 2020 11:03:48 PM EDT. [MIRROR] pgdg-redhat-repo-latest.noarch.rpm: Status code: 404 for https://download.postgresql.org/pub/repos/yum/12/redhat/rhel-8-x86_64/pgdg-r... (IP: 72.32.157.246) [MIRROR] pgdg-redhat-repo-latest.noarch.rpm: Status code: 404 for https://download.postgresql.org/pub/repos/yum/12/redhat/rhel-8-x86_64/pgdg-r... (IP: 72.32.157.246) [MIRROR] pgdg-redhat-repo-latest.noarch.rpm: Status code: 404 for https://download.postgresql.org/pub/repos/yum/12/redhat/rhel-8-x86_64/pgdg-r... (IP: 72.32.157.246) [MIRROR] pgdg-redhat-repo-latest.noarch.rpm: Status code: 404 for https://download.postgresql.org/pub/repos/yum/12/redhat/rhel-8-x86_64/pgdg-r... (IP: 72.32.157.246) [FAILED] pgdg-redhat-repo-latest.noarch.rpm: Status code: 404 for https://download.postgresql.org/pub/repos/yum/12/redhat/rhel-8-x86_64/pgdg-r... (IP: 72.32.157.246) lago.ssh: DEBUG: Command aee507f2 on lago-performance-suite-master-engine errors: + pg_datadir=/var/lib/pgsql/data + pg_service=postgresql.service + pgdg= + scl_enable= ++ get_engine_pg_scl ++ engine_pg_scl_conf=(/etc/ovirt-engine/engine.conf.d/*scl-postgres*.conf) ++ local engine_pg_scl_conf ++ local res= ++ [[ -e /etc/ovirt-engine/engine.conf.d/*scl-postgres*.conf ]] ++ echo '' + engine_pg_scl= + [[ -n '' ]] ++ rpm -q postgresql + pgver=postgresql-12.1-2.module_el8.1.0+273+979c16e6.x86_64 + case "${pgver}" in + pgdg=https://download.postgresql.org/pub/repos/yum/12/redhat/rhel-8-x86_64/pgdg-r... + [[ -n https://download.postgresql.org/pub/repos/yum/12/redhat/rhel-8-x86_64/pgdg-r... ]] + yum install -y https://download.postgresql.org/pub/repos/yum/12/redhat/rhel-8-x86_64/pgdg-r... Status code: 404 for https://download.postgresql.org/pub/repos/yum/12/redhat/rhel-8-x86_64/pgdg-r... (IP: 72.32.157.246) --------------------- >> end captured logging << --------------------- Stack Trace: File "/usr/lib64/python2.7/unittest/case.py", line 369, in run testMethod() File "/usr/lib/python2.7/site-packages/nose/case.py", line 197, in runTest self.test(*self.arg) File "/usr/lib/python2.7/site-packages/ovirtlago/testlib.py", line 142, in wrapped_test test() File "/usr/lib/python2.7/site-packages/ovirtlago/testlib.py", line 60, in wrapper return func(get_test_prefix(), *args, **kwargs) File "/home/jenkins/agent/workspace/ovirt-system-tests_performance-suite-master/ovirt-system-tests/performance-suite-master/test-scenarios/1000_analyze_postgresql.py", line 52, in analyze_postgres ' Exit code is %s' % result.code File "/usr/lib/python2.7/site-packages/nose/tools/trivial.py", line 29, in eq_ raise AssertionError(msg or "%r != %r" % (a, b)) 'Failed to perform the postgres analysis. Exit code is 1\n-------------------- >> begin captured logging << --------------------\nlago.plugins.vm: INFO: * Copy /home/jenkins/agent/workspace/ovirt-system-tests_performance-suite-master/ovirt-system-tests/performance-suite-master/../common/test-scenarios-files/analyze_postgresql.sh to lago-performance-suite-master-engine:/root: \x1b[0m\x1b[0m\nlago.ssh: DEBUG: start task:a9b6bf76-d6a4-4f6d-938d-59d14cc805d8:Get ssh client for lago-performance-suite-master-engine:\nlago.ssh: DEBUG: end task:a9b6bf76-d6a4-4f6d-938d-59d14cc805d8:Get ssh client for lago-performance-suite-master-engine:\nlago.plugins.vm: INFO: * Copy /home/jenkins/agent/workspace/ovirt-system-tests_performance-suite-master/ovirt-system-tests/performance-suite-master/../common/test-scenarios-files/analyze_postgresql.sh to lago-performance-suite-master-engine:/root: \x1b[32mSuccess\x1b[0m (in 0:00:00)\nlago.ssh: DEBUG: start task:3cbcc980-918f-4be9-ac5e-e10f86305521:Get ssh client for lago-performance-suite-master-engine:\nlago.ssh: DEBUG: end task:3cbcc980-918f-4be9-ac5e-e10f86305521:Get ssh client for lago-performance-suite-master-engine:\nlago.ssh: DEBUG: Running aee507f2 on lago-performance-suite-master-engine: /root/analyze_postgresql.sh\nlago.ssh: DEBUG: Command aee507f2 on lago-performance-suite-master-engine returned with 1\nlago.ssh: DEBUG: Command aee507f2 on lago-performance-suite-master-engine output:\n Last metadata expiration check: 0:11:06 ago on Thu 16 Jul 2020 11:03:48 PM EDT.\n[MIRROR] pgdg-redhat-repo-latest.noarch.rpm: Status code: 404 for https://download.postgresql.org/pub/repos/yum/12/redhat/rhel-8-x86_64/pgdg-r... (IP: 72.32.157.246)\n[MIRROR] pgdg-redhat-repo-latest.noarch.rpm: Status code: 404 for https://download.postgresql.org/pub/repos/yum/12/redhat/rhel-8-x86_64/pgdg-r... (IP: 72.32.157.246)\n[MIRROR] pgdg-redhat-repo-latest.noarch.rpm: Status code: 404 for https://download.postgresql.org/pub/repos/yum/12/redhat/rhel-8-x86_64/pgdg-r... (IP: 72.32.157.246)\n[MIRROR] pgdg-redhat-repo-latest.noarch.rpm: Status code: 404 for https://download.postgresql.org/pub/repos/yum/12/redhat/rhel-8-x86_64/pgdg-r... (IP: 72.32.157.246)\n[FAILED] pgdg-redhat-repo-latest.noarch.rpm: Status code: 404 for https://download.postgresql.org/pub/repos/yum/12/redhat/rhel-8-x86_64/pgdg-r... (IP: 72.32.157.246)\n\nlago.ssh: DEBUG: Command aee507f2 on lago-performance-suite-master-engine errors:\n + pg_datadir=/var/lib/pgsql/data\n+ pg_service=postgresql.service\n+ pgdg=\n+ scl_enable=\n++ get_engine_pg_scl\n++ engine_pg_scl_conf=(/etc/ovirt-engine/engine.conf.d/*scl-postgres*.conf)\n++ local engine_pg_scl_conf\n++ local res=\n++ [[ -e /etc/ovirt-engine/engine.conf.d/*scl-postgres*.conf ]]\n++ echo \'\'\n+ engine_pg_scl=\n+ [[ -n \'\' ]]\n++ rpm -q postgresql\n+ pgver=postgresql-12.1-2.module_el8.1.0+273+979c16e6.x86_64\n+ case "${pgver}" in\n+ pgdg=https://download.postgresql.org/pub/repos/yum/12/redhat/rhel-8-x86_64/pgdg-redhat-repo-latest.noarch.rpm\n+ [[ -n https://download.postgresql.org/pub/repos/yum/12/redhat/rhel-8-x86_64/pgdg-r... ]]\n+ yum install -y https://download.postgresql.org/pub/repos/yum/12/redhat/rhel-8-x86_64/pgdg-redhat-repo-latest.noarch.rpm\nStatus code: 404 for https://download.postgresql.org/pub/repos/yum/12/redhat/rhel-8-x86_64/pgdg-r... (IP: 72.32.157.246)\n\n--------------------- >> end captured logging << ---------------------'

Project: https://jenkins.ovirt.org/job/ovirt-system-tests_performance-suite-master/ Build: https://jenkins.ovirt.org/job/ovirt-system-tests_performance-suite-master/15... Build Number: 1522 Build Status: Still Failing Triggered By: Started by timer ------------------------------------- Changes Since Last Success: ------------------------------------- Changes for Build #1516 [Marcin Sobczyk] network: Run network suite master on el8 Changes for Build #1517 [Andrej Cernek] network, hostlib: refactor setup_networks method [Barak Korren] usrc: Support *.yml files Changes for Build #1518 [Galit] Remove basic-suite-4.2 suite Changes for Build #1519 [Marcin Sobczyk] basic: Verify glance template creation before tearing down the engine Changes for Build #1520 [Marcin Sobczyk] ost-images: Use OST images when available Changes for Build #1521 [Ehud Yonasi] fix el7 container label. [Roy Golan] Removing rgolan@redhat.com from email notifs Changes for Build #1522 [Marcin Sobczyk] ost_utils: Add ansible fixtures ----------------- Failed Tests: ----------------- 1 tests failed. FAILED: 1000_analyze_postgresql.analyze_postgres Error Message: Failed to perform the postgres analysis. Exit code is 1 -------------------- >> begin captured logging << -------------------- lago.plugins.vm: INFO: * Copy /home/jenkins/agent/workspace/ovirt-system-tests_performance-suite-master/ovirt-system-tests/performance-suite-master/../common/test-scenarios-files/analyze_postgresql.sh to lago-performance-suite-master-engine:/root: ?[0m?[0m lago.ssh: DEBUG: start task:36a98468-112f-4caf-a3a9-46ee255781b1:Get ssh client for lago-performance-suite-master-engine: lago.ssh: DEBUG: end task:36a98468-112f-4caf-a3a9-46ee255781b1:Get ssh client for lago-performance-suite-master-engine: lago.plugins.vm: INFO: * Copy /home/jenkins/agent/workspace/ovirt-system-tests_performance-suite-master/ovirt-system-tests/performance-suite-master/../common/test-scenarios-files/analyze_postgresql.sh to lago-performance-suite-master-engine:/root: ?[32mSuccess?[0m (in 0:00:00) lago.ssh: DEBUG: start task:561283af-4e43-405b-94ce-51b63e0f7b62:Get ssh client for lago-performance-suite-master-engine: lago.ssh: DEBUG: end task:561283af-4e43-405b-94ce-51b63e0f7b62:Get ssh client for lago-performance-suite-master-engine: lago.ssh: DEBUG: Running 9e9fb234 on lago-performance-suite-master-engine: /root/analyze_postgresql.sh lago.ssh: DEBUG: Command 9e9fb234 on lago-performance-suite-master-engine returned with 1 lago.ssh: DEBUG: Command 9e9fb234 on lago-performance-suite-master-engine output: Last metadata expiration check: 0:10:42 ago on Fri 17 Jul 2020 10:55:25 PM EDT. [MIRROR] pgdg-redhat-repo-latest.noarch.rpm: Status code: 404 for https://download.postgresql.org/pub/repos/yum/12/redhat/rhel-8-x86_64/pgdg-r... (IP: 87.238.57.227) [MIRROR] pgdg-redhat-repo-latest.noarch.rpm: Status code: 404 for https://download.postgresql.org/pub/repos/yum/12/redhat/rhel-8-x86_64/pgdg-r... (IP: 87.238.57.227) [MIRROR] pgdg-redhat-repo-latest.noarch.rpm: Status code: 404 for https://download.postgresql.org/pub/repos/yum/12/redhat/rhel-8-x86_64/pgdg-r... (IP: 87.238.57.227) [MIRROR] pgdg-redhat-repo-latest.noarch.rpm: Status code: 404 for https://download.postgresql.org/pub/repos/yum/12/redhat/rhel-8-x86_64/pgdg-r... (IP: 87.238.57.227) [FAILED] pgdg-redhat-repo-latest.noarch.rpm: Status code: 404 for https://download.postgresql.org/pub/repos/yum/12/redhat/rhel-8-x86_64/pgdg-r... (IP: 87.238.57.227) lago.ssh: DEBUG: Command 9e9fb234 on lago-performance-suite-master-engine errors: + pg_datadir=/var/lib/pgsql/data + pg_service=postgresql.service + pgdg= + scl_enable= ++ get_engine_pg_scl ++ engine_pg_scl_conf=(/etc/ovirt-engine/engine.conf.d/*scl-postgres*.conf) ++ local engine_pg_scl_conf ++ local res= ++ [[ -e /etc/ovirt-engine/engine.conf.d/*scl-postgres*.conf ]] ++ echo '' + engine_pg_scl= + [[ -n '' ]] ++ rpm -q postgresql + pgver=postgresql-12.1-2.module_el8.1.0+273+979c16e6.x86_64 + case "${pgver}" in + pgdg=https://download.postgresql.org/pub/repos/yum/12/redhat/rhel-8-x86_64/pgdg-r... + [[ -n https://download.postgresql.org/pub/repos/yum/12/redhat/rhel-8-x86_64/pgdg-r... ]] + yum install -y https://download.postgresql.org/pub/repos/yum/12/redhat/rhel-8-x86_64/pgdg-r... Status code: 404 for https://download.postgresql.org/pub/repos/yum/12/redhat/rhel-8-x86_64/pgdg-r... (IP: 87.238.57.227) --------------------- >> end captured logging << --------------------- Stack Trace: File "/usr/lib64/python2.7/unittest/case.py", line 369, in run testMethod() File "/usr/lib/python2.7/site-packages/nose/case.py", line 197, in runTest self.test(*self.arg) File "/usr/lib/python2.7/site-packages/ovirtlago/testlib.py", line 142, in wrapped_test test() File "/usr/lib/python2.7/site-packages/ovirtlago/testlib.py", line 60, in wrapper return func(get_test_prefix(), *args, **kwargs) File "/home/jenkins/agent/workspace/ovirt-system-tests_performance-suite-master/ovirt-system-tests/performance-suite-master/test-scenarios/1000_analyze_postgresql.py", line 52, in analyze_postgres ' Exit code is %s' % result.code File "/usr/lib/python2.7/site-packages/nose/tools/trivial.py", line 29, in eq_ raise AssertionError(msg or "%r != %r" % (a, b)) 'Failed to perform the postgres analysis. Exit code is 1\n-------------------- >> begin captured logging << --------------------\nlago.plugins.vm: INFO: * Copy /home/jenkins/agent/workspace/ovirt-system-tests_performance-suite-master/ovirt-system-tests/performance-suite-master/../common/test-scenarios-files/analyze_postgresql.sh to lago-performance-suite-master-engine:/root: \x1b[0m\x1b[0m\nlago.ssh: DEBUG: start task:36a98468-112f-4caf-a3a9-46ee255781b1:Get ssh client for lago-performance-suite-master-engine:\nlago.ssh: DEBUG: end task:36a98468-112f-4caf-a3a9-46ee255781b1:Get ssh client for lago-performance-suite-master-engine:\nlago.plugins.vm: INFO: * Copy /home/jenkins/agent/workspace/ovirt-system-tests_performance-suite-master/ovirt-system-tests/performance-suite-master/../common/test-scenarios-files/analyze_postgresql.sh to lago-performance-suite-master-engine:/root: \x1b[32mSuccess\x1b[0m (in 0:00:00)\nlago.ssh: DEBUG: start task:561283af-4e43-405b-94ce-51b63e0f7b62:Get ssh client for lago-performance-suite-master-engine:\nlago.ssh: DEBUG: end task:561283af-4e43-405b-94ce-51b63e0f7b62:Get ssh client for lago-performance-suite-master-engine:\nlago.ssh: DEBUG: Running 9e9fb234 on lago-performance-suite-master-engine: /root/analyze_postgresql.sh\nlago.ssh: DEBUG: Command 9e9fb234 on lago-performance-suite-master-engine returned with 1\nlago.ssh: DEBUG: Command 9e9fb234 on lago-performance-suite-master-engine output:\n Last metadata expiration check: 0:10:42 ago on Fri 17 Jul 2020 10:55:25 PM EDT.\n[MIRROR] pgdg-redhat-repo-latest.noarch.rpm: Status code: 404 for https://download.postgresql.org/pub/repos/yum/12/redhat/rhel-8-x86_64/pgdg-r... (IP: 87.238.57.227)\n[MIRROR] pgdg-redhat-repo-latest.noarch.rpm: Status code: 404 for https://download.postgresql.org/pub/repos/yum/12/redhat/rhel-8-x86_64/pgdg-r... (IP: 87.238.57.227)\n[MIRROR] pgdg-redhat-repo-latest.noarch.rpm: Status code: 404 for https://download.postgresql.org/pub/repos/yum/12/redhat/rhel-8-x86_64/pgdg-r... (IP: 87.238.57.227)\n[MIRROR] pgdg-redhat-repo-latest.noarch.rpm: Status code: 404 for https://download.postgresql.org/pub/repos/yum/12/redhat/rhel-8-x86_64/pgdg-r... (IP: 87.238.57.227)\n[FAILED] pgdg-redhat-repo-latest.noarch.rpm: Status code: 404 for https://download.postgresql.org/pub/repos/yum/12/redhat/rhel-8-x86_64/pgdg-r... (IP: 87.238.57.227)\n\nlago.ssh: DEBUG: Command 9e9fb234 on lago-performance-suite-master-engine errors:\n + pg_datadir=/var/lib/pgsql/data\n+ pg_service=postgresql.service\n+ pgdg=\n+ scl_enable=\n++ get_engine_pg_scl\n++ engine_pg_scl_conf=(/etc/ovirt-engine/engine.conf.d/*scl-postgres*.conf)\n++ local engine_pg_scl_conf\n++ local res=\n++ [[ -e /etc/ovirt-engine/engine.conf.d/*scl-postgres*.conf ]]\n++ echo \'\'\n+ engine_pg_scl=\n+ [[ -n \'\' ]]\n++ rpm -q postgresql\n+ pgver=postgresql-12.1-2.module_el8.1.0+273+979c16e6.x86_64\n+ case "${pgver}" in\n+ pgdg=https://download.postgresql.org/pub/repos/yum/12/redhat/rhel-8-x86_64/pgdg-redhat-repo-latest.noarch.rpm\n+ [[ -n https://download.postgresql.org/pub/repos/yum/12/redhat/rhel-8-x86_64/pgdg-r... ]]\n+ yum install -y https://download.postgresql.org/pub/repos/yum/12/redhat/rhel-8-x86_64/pgdg-redhat-repo-latest.noarch.rpm\nStatus code: 404 for https://download.postgresql.org/pub/repos/yum/12/redhat/rhel-8-x86_64/pgdg-r... (IP: 87.238.57.227)\n\n--------------------- >> end captured logging << ---------------------'

Project: https://jenkins.ovirt.org/job/ovirt-system-tests_performance-suite-master/ Build: https://jenkins.ovirt.org/job/ovirt-system-tests_performance-suite-master/15... Build Number: 1523 Build Status: Still Failing Triggered By: Started by timer ------------------------------------- Changes Since Last Success: ------------------------------------- Changes for Build #1516 [Marcin Sobczyk] network: Run network suite master on el8 Changes for Build #1517 [Andrej Cernek] network, hostlib: refactor setup_networks method [Barak Korren] usrc: Support *.yml files Changes for Build #1518 [Galit] Remove basic-suite-4.2 suite Changes for Build #1519 [Marcin Sobczyk] basic: Verify glance template creation before tearing down the engine Changes for Build #1520 [Marcin Sobczyk] ost-images: Use OST images when available Changes for Build #1521 [Ehud Yonasi] fix el7 container label. [Roy Golan] Removing rgolan@redhat.com from email notifs Changes for Build #1522 [Marcin Sobczyk] ost_utils: Add ansible fixtures Changes for Build #1523 [Marcin Sobczyk] ost_utils: Add ansible fixtures ----------------- Failed Tests: ----------------- 1 tests failed. FAILED: 1000_analyze_postgresql.analyze_postgres Error Message: Failed to perform the postgres analysis. Exit code is 1 -------------------- >> begin captured logging << -------------------- lago.plugins.vm: INFO: * Copy /home/jenkins/agent/workspace/ovirt-system-tests_performance-suite-master/ovirt-system-tests/performance-suite-master/../common/test-scenarios-files/analyze_postgresql.sh to lago-performance-suite-master-engine:/root: ?[0m?[0m lago.ssh: DEBUG: start task:0f962407-a69e-4ac7-aae9-a538b02cba56:Get ssh client for lago-performance-suite-master-engine: lago.ssh: DEBUG: end task:0f962407-a69e-4ac7-aae9-a538b02cba56:Get ssh client for lago-performance-suite-master-engine: lago.plugins.vm: INFO: * Copy /home/jenkins/agent/workspace/ovirt-system-tests_performance-suite-master/ovirt-system-tests/performance-suite-master/../common/test-scenarios-files/analyze_postgresql.sh to lago-performance-suite-master-engine:/root: ?[32mSuccess?[0m (in 0:00:00) lago.ssh: DEBUG: start task:2cf7bd9d-b40d-4cb2-9515-2c2c0f4ae9a7:Get ssh client for lago-performance-suite-master-engine: lago.ssh: DEBUG: end task:2cf7bd9d-b40d-4cb2-9515-2c2c0f4ae9a7:Get ssh client for lago-performance-suite-master-engine: lago.ssh: DEBUG: Running e14dd60a on lago-performance-suite-master-engine: /root/analyze_postgresql.sh lago.ssh: DEBUG: Command e14dd60a on lago-performance-suite-master-engine returned with 1 lago.ssh: DEBUG: Command e14dd60a on lago-performance-suite-master-engine output: Last metadata expiration check: 0:11:56 ago on Sat 18 Jul 2020 10:54:52 PM EDT. [MIRROR] pgdg-redhat-repo-latest.noarch.rpm: Status code: 404 for https://download.postgresql.org/pub/repos/yum/12/redhat/rhel-8-x86_64/pgdg-r... (IP: 217.196.149.55) [MIRROR] pgdg-redhat-repo-latest.noarch.rpm: Status code: 404 for https://download.postgresql.org/pub/repos/yum/12/redhat/rhel-8-x86_64/pgdg-r... (IP: 217.196.149.55) [MIRROR] pgdg-redhat-repo-latest.noarch.rpm: Status code: 404 for https://download.postgresql.org/pub/repos/yum/12/redhat/rhel-8-x86_64/pgdg-r... (IP: 217.196.149.55) [MIRROR] pgdg-redhat-repo-latest.noarch.rpm: Status code: 404 for https://download.postgresql.org/pub/repos/yum/12/redhat/rhel-8-x86_64/pgdg-r... (IP: 217.196.149.55) [FAILED] pgdg-redhat-repo-latest.noarch.rpm: Status code: 404 for https://download.postgresql.org/pub/repos/yum/12/redhat/rhel-8-x86_64/pgdg-r... (IP: 217.196.149.55) lago.ssh: DEBUG: Command e14dd60a on lago-performance-suite-master-engine errors: + pg_datadir=/var/lib/pgsql/data + pg_service=postgresql.service + pgdg= + scl_enable= ++ get_engine_pg_scl ++ engine_pg_scl_conf=(/etc/ovirt-engine/engine.conf.d/*scl-postgres*.conf) ++ local engine_pg_scl_conf ++ local res= ++ [[ -e /etc/ovirt-engine/engine.conf.d/*scl-postgres*.conf ]] ++ echo '' + engine_pg_scl= + [[ -n '' ]] ++ rpm -q postgresql + pgver=postgresql-12.1-2.module_el8.1.0+273+979c16e6.x86_64 + case "${pgver}" in + pgdg=https://download.postgresql.org/pub/repos/yum/12/redhat/rhel-8-x86_64/pgdg-r... + [[ -n https://download.postgresql.org/pub/repos/yum/12/redhat/rhel-8-x86_64/pgdg-r... ]] + yum install -y https://download.postgresql.org/pub/repos/yum/12/redhat/rhel-8-x86_64/pgdg-r... Status code: 404 for https://download.postgresql.org/pub/repos/yum/12/redhat/rhel-8-x86_64/pgdg-r... (IP: 217.196.149.55) --------------------- >> end captured logging << --------------------- Stack Trace: File "/usr/lib64/python2.7/unittest/case.py", line 369, in run testMethod() File "/usr/lib/python2.7/site-packages/nose/case.py", line 197, in runTest self.test(*self.arg) File "/usr/lib/python2.7/site-packages/ovirtlago/testlib.py", line 142, in wrapped_test test() File "/usr/lib/python2.7/site-packages/ovirtlago/testlib.py", line 60, in wrapper return func(get_test_prefix(), *args, **kwargs) File "/home/jenkins/agent/workspace/ovirt-system-tests_performance-suite-master/ovirt-system-tests/performance-suite-master/test-scenarios/1000_analyze_postgresql.py", line 52, in analyze_postgres ' Exit code is %s' % result.code File "/usr/lib/python2.7/site-packages/nose/tools/trivial.py", line 29, in eq_ raise AssertionError(msg or "%r != %r" % (a, b)) 'Failed to perform the postgres analysis. Exit code is 1\n-------------------- >> begin captured logging << --------------------\nlago.plugins.vm: INFO: * Copy /home/jenkins/agent/workspace/ovirt-system-tests_performance-suite-master/ovirt-system-tests/performance-suite-master/../common/test-scenarios-files/analyze_postgresql.sh to lago-performance-suite-master-engine:/root: \x1b[0m\x1b[0m\nlago.ssh: DEBUG: start task:0f962407-a69e-4ac7-aae9-a538b02cba56:Get ssh client for lago-performance-suite-master-engine:\nlago.ssh: DEBUG: end task:0f962407-a69e-4ac7-aae9-a538b02cba56:Get ssh client for lago-performance-suite-master-engine:\nlago.plugins.vm: INFO: * Copy /home/jenkins/agent/workspace/ovirt-system-tests_performance-suite-master/ovirt-system-tests/performance-suite-master/../common/test-scenarios-files/analyze_postgresql.sh to lago-performance-suite-master-engine:/root: \x1b[32mSuccess\x1b[0m (in 0:00:00)\nlago.ssh: DEBUG: start task:2cf7bd9d-b40d-4cb2-9515-2c2c0f4ae9a7:Get ssh client for lago-performance-suite-master-engine:\nlago.ssh: DEBUG: end task:2cf7bd9d-b40d-4cb2-9515-2c2c0f4ae9a7:Get ssh client for lago-performance-suite-master-engine:\nlago.ssh: DEBUG: Running e14dd60a on lago-performance-suite-master-engine: /root/analyze_postgresql.sh\nlago.ssh: DEBUG: Command e14dd60a on lago-performance-suite-master-engine returned with 1\nlago.ssh: DEBUG: Command e14dd60a on lago-performance-suite-master-engine output:\n Last metadata expiration check: 0:11:56 ago on Sat 18 Jul 2020 10:54:52 PM EDT.\n[MIRROR] pgdg-redhat-repo-latest.noarch.rpm: Status code: 404 for https://download.postgresql.org/pub/repos/yum/12/redhat/rhel-8-x86_64/pgdg-r... (IP: 217.196.149.55)\n[MIRROR] pgdg-redhat-repo-latest.noarch.rpm: Status code: 404 for https://download.postgresql.org/pub/repos/yum/12/redhat/rhel-8-x86_64/pgdg-r... (IP: 217.196.149.55)\n[MIRROR] pgdg-redhat-repo-latest.noarch.rpm: Status code: 404 for https://download.postgresql.org/pub/repos/yum/12/redhat/rhel-8-x86_64/pgdg-r... (IP: 217.196.149.55)\n[MIRROR] pgdg-redhat-repo-latest.noarch.rpm: Status code: 404 for https://download.postgresql.org/pub/repos/yum/12/redhat/rhel-8-x86_64/pgdg-r... (IP: 217.196.149.55)\n[FAILED] pgdg-redhat-repo-latest.noarch.rpm: Status code: 404 for https://download.postgresql.org/pub/repos/yum/12/redhat/rhel-8-x86_64/pgdg-r... (IP: 217.196.149.55)\n\nlago.ssh: DEBUG: Command e14dd60a on lago-performance-suite-master-engine errors:\n + pg_datadir=/var/lib/pgsql/data\n+ pg_service=postgresql.service\n+ pgdg=\n+ scl_enable=\n++ get_engine_pg_scl\n++ engine_pg_scl_conf=(/etc/ovirt-engine/engine.conf.d/*scl-postgres*.conf)\n++ local engine_pg_scl_conf\n++ local res=\n++ [[ -e /etc/ovirt-engine/engine.conf.d/*scl-postgres*.conf ]]\n++ echo \'\'\n+ engine_pg_scl=\n+ [[ -n \'\' ]]\n++ rpm -q postgresql\n+ pgver=postgresql-12.1-2.module_el8.1.0+273+979c16e6.x86_64\n+ case "${pgver}" in\n+ pgdg=https://download.postgresql.org/pub/repos/yum/12/redhat/rhel-8-x86_64/pgdg-redhat-repo-latest.noarch.rpm\n+ [[ -n https://download.postgresql.org/pub/repos/yum/12/redhat/rhel-8-x86_64/pgdg-r... ]]\n+ yum install -y https://download.postgresql.org/pub/repos/yum/12/redhat/rhel-8-x86_64/pgdg-redhat-repo-latest.noarch.rpm\nStatus code: 404 for https://download.postgresql.org/pub/repos/yum/12/redhat/rhel-8-x86_64/pgdg-r... (IP: 217.196.149.55)\n\n--------------------- >> end captured logging << ---------------------'

Project: https://jenkins.ovirt.org/job/ovirt-system-tests_performance-suite-master/ Build: https://jenkins.ovirt.org/job/ovirt-system-tests_performance-suite-master/15... Build Number: 1524 Build Status: Still Failing Triggered By: Started by timer ------------------------------------- Changes Since Last Success: ------------------------------------- Changes for Build #1516 [Marcin Sobczyk] network: Run network suite master on el8 Changes for Build #1517 [Andrej Cernek] network, hostlib: refactor setup_networks method [Barak Korren] usrc: Support *.yml files Changes for Build #1518 [Galit] Remove basic-suite-4.2 suite Changes for Build #1519 [Marcin Sobczyk] basic: Verify glance template creation before tearing down the engine Changes for Build #1520 [Marcin Sobczyk] ost-images: Use OST images when available Changes for Build #1521 [Ehud Yonasi] fix el7 container label. [Roy Golan] Removing rgolan@redhat.com from email notifs Changes for Build #1522 [Marcin Sobczyk] ost_utils: Add ansible fixtures Changes for Build #1523 [Marcin Sobczyk] ost_utils: Add ansible fixtures Changes for Build #1524 [Marcin Sobczyk] ost_utils: Add ansible fixtures ----------------- Failed Tests: ----------------- 1 tests failed. FAILED: 1000_analyze_postgresql.analyze_postgres Error Message: Failed to perform the postgres analysis. Exit code is 1 -------------------- >> begin captured logging << -------------------- lago.plugins.vm: INFO: * Copy /home/jenkins/agent/workspace/ovirt-system-tests_performance-suite-master/ovirt-system-tests/performance-suite-master/../common/test-scenarios-files/analyze_postgresql.sh to lago-performance-suite-master-engine:/root: ?[0m?[0m lago.ssh: DEBUG: start task:95b6f414-d760-4b09-b1a2-b6408e063f19:Get ssh client for lago-performance-suite-master-engine: lago.ssh: DEBUG: end task:95b6f414-d760-4b09-b1a2-b6408e063f19:Get ssh client for lago-performance-suite-master-engine: lago.plugins.vm: INFO: * Copy /home/jenkins/agent/workspace/ovirt-system-tests_performance-suite-master/ovirt-system-tests/performance-suite-master/../common/test-scenarios-files/analyze_postgresql.sh to lago-performance-suite-master-engine:/root: ?[32mSuccess?[0m (in 0:00:00) lago.ssh: DEBUG: start task:176961b4-35e3-4845-beb1-a84886505dad:Get ssh client for lago-performance-suite-master-engine: lago.ssh: DEBUG: end task:176961b4-35e3-4845-beb1-a84886505dad:Get ssh client for lago-performance-suite-master-engine: lago.ssh: DEBUG: Running b7017f68 on lago-performance-suite-master-engine: /root/analyze_postgresql.sh lago.ssh: DEBUG: Command b7017f68 on lago-performance-suite-master-engine returned with 1 lago.ssh: DEBUG: Command b7017f68 on lago-performance-suite-master-engine output: Last metadata expiration check: 0:10:26 ago on Sun 19 Jul 2020 10:53:59 PM EDT. [MIRROR] pgdg-redhat-repo-latest.noarch.rpm: Status code: 404 for https://download.postgresql.org/pub/repos/yum/12/redhat/rhel-8-x86_64/pgdg-r... (IP: 217.196.149.55) [MIRROR] pgdg-redhat-repo-latest.noarch.rpm: Status code: 404 for https://download.postgresql.org/pub/repos/yum/12/redhat/rhel-8-x86_64/pgdg-r... (IP: 217.196.149.55) [MIRROR] pgdg-redhat-repo-latest.noarch.rpm: Status code: 404 for https://download.postgresql.org/pub/repos/yum/12/redhat/rhel-8-x86_64/pgdg-r... (IP: 217.196.149.55) [MIRROR] pgdg-redhat-repo-latest.noarch.rpm: Status code: 404 for https://download.postgresql.org/pub/repos/yum/12/redhat/rhel-8-x86_64/pgdg-r... (IP: 217.196.149.55) [FAILED] pgdg-redhat-repo-latest.noarch.rpm: Status code: 404 for https://download.postgresql.org/pub/repos/yum/12/redhat/rhel-8-x86_64/pgdg-r... (IP: 217.196.149.55) lago.ssh: DEBUG: Command b7017f68 on lago-performance-suite-master-engine errors: + pg_datadir=/var/lib/pgsql/data + pg_service=postgresql.service + pgdg= + scl_enable= ++ get_engine_pg_scl ++ engine_pg_scl_conf=(/etc/ovirt-engine/engine.conf.d/*scl-postgres*.conf) ++ local engine_pg_scl_conf ++ local res= ++ [[ -e /etc/ovirt-engine/engine.conf.d/*scl-postgres*.conf ]] ++ echo '' + engine_pg_scl= + [[ -n '' ]] ++ rpm -q postgresql + pgver=postgresql-12.1-2.module_el8.1.0+273+979c16e6.x86_64 + case "${pgver}" in + pgdg=https://download.postgresql.org/pub/repos/yum/12/redhat/rhel-8-x86_64/pgdg-r... + [[ -n https://download.postgresql.org/pub/repos/yum/12/redhat/rhel-8-x86_64/pgdg-r... ]] + yum install -y https://download.postgresql.org/pub/repos/yum/12/redhat/rhel-8-x86_64/pgdg-r... Status code: 404 for https://download.postgresql.org/pub/repos/yum/12/redhat/rhel-8-x86_64/pgdg-r... (IP: 217.196.149.55) --------------------- >> end captured logging << --------------------- Stack Trace: File "/usr/lib64/python2.7/unittest/case.py", line 369, in run testMethod() File "/usr/lib/python2.7/site-packages/nose/case.py", line 197, in runTest self.test(*self.arg) File "/usr/lib/python2.7/site-packages/ovirtlago/testlib.py", line 142, in wrapped_test test() File "/usr/lib/python2.7/site-packages/ovirtlago/testlib.py", line 60, in wrapper return func(get_test_prefix(), *args, **kwargs) File "/home/jenkins/agent/workspace/ovirt-system-tests_performance-suite-master/ovirt-system-tests/performance-suite-master/test-scenarios/1000_analyze_postgresql.py", line 52, in analyze_postgres ' Exit code is %s' % result.code File "/usr/lib/python2.7/site-packages/nose/tools/trivial.py", line 29, in eq_ raise AssertionError(msg or "%r != %r" % (a, b)) 'Failed to perform the postgres analysis. Exit code is 1\n-------------------- >> begin captured logging << --------------------\nlago.plugins.vm: INFO: * Copy /home/jenkins/agent/workspace/ovirt-system-tests_performance-suite-master/ovirt-system-tests/performance-suite-master/../common/test-scenarios-files/analyze_postgresql.sh to lago-performance-suite-master-engine:/root: \x1b[0m\x1b[0m\nlago.ssh: DEBUG: start task:95b6f414-d760-4b09-b1a2-b6408e063f19:Get ssh client for lago-performance-suite-master-engine:\nlago.ssh: DEBUG: end task:95b6f414-d760-4b09-b1a2-b6408e063f19:Get ssh client for lago-performance-suite-master-engine:\nlago.plugins.vm: INFO: * Copy /home/jenkins/agent/workspace/ovirt-system-tests_performance-suite-master/ovirt-system-tests/performance-suite-master/../common/test-scenarios-files/analyze_postgresql.sh to lago-performance-suite-master-engine:/root: \x1b[32mSuccess\x1b[0m (in 0:00:00)\nlago.ssh: DEBUG: start task:176961b4-35e3-4845-beb1-a84886505dad:Get ssh client for lago-performance-suite-master-engine:\nlago.ssh: DEBUG: end task:176961b4-35e3-4845-beb1-a84886505dad:Get ssh client for lago-performance-suite-master-engine:\nlago.ssh: DEBUG: Running b7017f68 on lago-performance-suite-master-engine: /root/analyze_postgresql.sh\nlago.ssh: DEBUG: Command b7017f68 on lago-performance-suite-master-engine returned with 1\nlago.ssh: DEBUG: Command b7017f68 on lago-performance-suite-master-engine output:\n Last metadata expiration check: 0:10:26 ago on Sun 19 Jul 2020 10:53:59 PM EDT.\n[MIRROR] pgdg-redhat-repo-latest.noarch.rpm: Status code: 404 for https://download.postgresql.org/pub/repos/yum/12/redhat/rhel-8-x86_64/pgdg-r... (IP: 217.196.149.55)\n[MIRROR] pgdg-redhat-repo-latest.noarch.rpm: Status code: 404 for https://download.postgresql.org/pub/repos/yum/12/redhat/rhel-8-x86_64/pgdg-r... (IP: 217.196.149.55)\n[MIRROR] pgdg-redhat-repo-latest.noarch.rpm: Status code: 404 for https://download.postgresql.org/pub/repos/yum/12/redhat/rhel-8-x86_64/pgdg-r... (IP: 217.196.149.55)\n[MIRROR] pgdg-redhat-repo-latest.noarch.rpm: Status code: 404 for https://download.postgresql.org/pub/repos/yum/12/redhat/rhel-8-x86_64/pgdg-r... (IP: 217.196.149.55)\n[FAILED] pgdg-redhat-repo-latest.noarch.rpm: Status code: 404 for https://download.postgresql.org/pub/repos/yum/12/redhat/rhel-8-x86_64/pgdg-r... (IP: 217.196.149.55)\n\nlago.ssh: DEBUG: Command b7017f68 on lago-performance-suite-master-engine errors:\n + pg_datadir=/var/lib/pgsql/data\n+ pg_service=postgresql.service\n+ pgdg=\n+ scl_enable=\n++ get_engine_pg_scl\n++ engine_pg_scl_conf=(/etc/ovirt-engine/engine.conf.d/*scl-postgres*.conf)\n++ local engine_pg_scl_conf\n++ local res=\n++ [[ -e /etc/ovirt-engine/engine.conf.d/*scl-postgres*.conf ]]\n++ echo \'\'\n+ engine_pg_scl=\n+ [[ -n \'\' ]]\n++ rpm -q postgresql\n+ pgver=postgresql-12.1-2.module_el8.1.0+273+979c16e6.x86_64\n+ case "${pgver}" in\n+ pgdg=https://download.postgresql.org/pub/repos/yum/12/redhat/rhel-8-x86_64/pgdg-redhat-repo-latest.noarch.rpm\n+ [[ -n https://download.postgresql.org/pub/repos/yum/12/redhat/rhel-8-x86_64/pgdg-r... ]]\n+ yum install -y https://download.postgresql.org/pub/repos/yum/12/redhat/rhel-8-x86_64/pgdg-redhat-repo-latest.noarch.rpm\nStatus code: 404 for https://download.postgresql.org/pub/repos/yum/12/redhat/rhel-8-x86_64/pgdg-r... (IP: 217.196.149.55)\n\n--------------------- >> end captured logging << ---------------------'

Project: https://jenkins.ovirt.org/job/ovirt-system-tests_performance-suite-master/ Build: https://jenkins.ovirt.org/job/ovirt-system-tests_performance-suite-master/15... Build Number: 1525 Build Status: Fixed Triggered By: Started by timer ------------------------------------- Changes Since Last Success: ------------------------------------- Changes for Build #1516 [Marcin Sobczyk] network: Run network suite master on el8 Changes for Build #1517 [Andrej Cernek] network, hostlib: refactor setup_networks method [Barak Korren] usrc: Support *.yml files Changes for Build #1518 [Galit] Remove basic-suite-4.2 suite Changes for Build #1519 [Marcin Sobczyk] basic: Verify glance template creation before tearing down the engine Changes for Build #1520 [Marcin Sobczyk] ost-images: Use OST images when available Changes for Build #1521 [Ehud Yonasi] fix el7 container label. [Roy Golan] Removing rgolan@redhat.com from email notifs Changes for Build #1522 [Marcin Sobczyk] ost_utils: Add ansible fixtures Changes for Build #1523 [Marcin Sobczyk] ost_utils: Add ansible fixtures Changes for Build #1524 [Marcin Sobczyk] ost_utils: Add ansible fixtures Changes for Build #1525 [Marcin Sobczyk] performance: Fix broken links for pgdg repos ----------------- Failed Tests: ----------------- All tests passed
participants (1)
-
jenkins@jenkins.phx.ovirt.org