[oVirt Jenkins] ovirt-system-tests_he-node-ng-suite-4.2 - Build # 432 - Failure!

Project: http://jenkins.ovirt.org/job/ovirt-system-tests_he-node-ng-suite-4.2/ Build: http://jenkins.ovirt.org/job/ovirt-system-tests_he-node-ng-suite-4.2/432/ Build Number: 432 Build Status: Failure Triggered By: Started by timer ------------------------------------- Changes Since Last Success: ------------------------------------- Changes for Build #432 [Miguel Duarte Barroso] Openvswitch 2.10 requires latest dpdk version ----------------- Failed Tests: ----------------- 1 tests failed. FAILED: 012_local_maintenance_sdk.local_maintenance Error Message: 143 -------------------- >> begin captured logging << -------------------- root: INFO: * Waiting For System Stability... root: INFO: * Performing Deactivation... cli: DEBUG: signal 15 was caught --------------------- >> end captured logging << --------------------- Stack Trace: File "/usr/lib64/python2.7/unittest/case.py", line 369, in run testMethod() File "/usr/lib/python2.7/site-packages/nose/case.py", line 197, in runTest self.test(*self.arg) File "/usr/lib/python2.7/site-packages/ovirtlago/testlib.py", line 142, in wrapped_test test() File "/usr/lib/python2.7/site-packages/ovirtlago/testlib.py", line 60, in wrapper return func(get_test_prefix(), *args, **kwargs) File "/usr/lib/python2.7/site-packages/ovirtlago/testlib.py", line 79, in wrapper prefix.virt_env.engine_vm().get_api(api_ver=4), *args, **kwargs File "/usr/lib/python2.7/site-packages/ovirtlago/testlib.py", line 60, in wrapper return func(get_test_prefix(), *args, **kwargs) File "/home/jenkins/workspace/ovirt-system-tests_he-node-ng-suite-4.2/ovirt-system-tests/he-node-ng-suite-4.2/test-scenarios/012_local_maintenance_sdk.py", line 65, in local_maintenance lambda: host_service.get().status == types.HostStatus.MAINTENANCE or File "/usr/lib/python2.7/site-packages/ovirtlago/testlib.py", line 286, in assert_true_within_long assert_equals_within_long(func, True, allowed_exceptions) File "/usr/lib/python2.7/site-packages/ovirtlago/testlib.py", line 273, in assert_equals_within_long func, value, LONG_TIMEOUT, allowed_exceptions=allowed_exceptions File "/usr/lib/python2.7/site-packages/ovirtlago/testlib.py", line 246, in assert_equals_within time.sleep(3) File "/usr/lib/python2.7/site-packages/lago/cmd.py", line 922, in exit_handler sys.exit(128 + signum) '143\n-------------------- >> begin captured logging << --------------------\nroot: INFO: * Waiting For System Stability...\nroot: INFO: * Performing Deactivation...\ncli: DEBUG: signal 15 was caught\n--------------------- >> end captured logging << ---------------------'

Project: http://jenkins.ovirt.org/job/ovirt-system-tests_he-node-ng-suite-4.2/ Build: http://jenkins.ovirt.org/job/ovirt-system-tests_he-node-ng-suite-4.2/433/ Build Number: 433 Build Status: Still Failing Triggered By: Started by timer ------------------------------------- Changes Since Last Success: ------------------------------------- Changes for Build #432 [Miguel Duarte Barroso] Openvswitch 2.10 requires latest dpdk version Changes for Build #433 [Miguel Duarte Barroso] Openvswitch 2.10 requires latest dpdk version ----------------- Failed Tests: ----------------- 1 tests failed. FAILED: 012_local_maintenance_sdk.local_maintenance Error Message: 143 -------------------- >> begin captured logging << -------------------- root: INFO: * Waiting For System Stability... root: INFO: * Performing Deactivation... root: INFO: * Performing Activation... root: INFO: * Waiting For System Stability... cli: DEBUG: signal 15 was caught --------------------- >> end captured logging << --------------------- Stack Trace: File "/usr/lib64/python2.7/unittest/case.py", line 369, in run testMethod() File "/usr/lib/python2.7/site-packages/nose/case.py", line 197, in runTest self.test(*self.arg) File "/usr/lib/python2.7/site-packages/ovirtlago/testlib.py", line 142, in wrapped_test test() File "/usr/lib/python2.7/site-packages/ovirtlago/testlib.py", line 60, in wrapper return func(get_test_prefix(), *args, **kwargs) File "/usr/lib/python2.7/site-packages/ovirtlago/testlib.py", line 79, in wrapper prefix.virt_env.engine_vm().get_api(api_ver=4), *args, **kwargs File "/usr/lib/python2.7/site-packages/ovirtlago/testlib.py", line 60, in wrapper return func(get_test_prefix(), *args, **kwargs) File "/home/jenkins/workspace/ovirt-system-tests_he-node-ng-suite-4.2/ovirt-system-tests/he-node-ng-suite-4.2/test-scenarios/012_local_maintenance_sdk.py", line 79, in local_maintenance time.sleep(wait_value) File "/usr/lib/python2.7/site-packages/lago/cmd.py", line 922, in exit_handler sys.exit(128 + signum) '143\n-------------------- >> begin captured logging << --------------------\nroot: INFO: * Waiting For System Stability...\nroot: INFO: * Performing Deactivation...\nroot: INFO: * Performing Activation...\nroot: INFO: * Waiting For System Stability...\ncli: DEBUG: signal 15 was caught\n--------------------- >> end captured logging << ---------------------'

Project: http://jenkins.ovirt.org/job/ovirt-system-tests_he-node-ng-suite-4.2/ Build: http://jenkins.ovirt.org/job/ovirt-system-tests_he-node-ng-suite-4.2/434/ Build Number: 434 Build Status: Still Failing Triggered By: Started by timer ------------------------------------- Changes Since Last Success: ------------------------------------- Changes for Build #432 [Miguel Duarte Barroso] Openvswitch 2.10 requires latest dpdk version Changes for Build #433 [Miguel Duarte Barroso] Openvswitch 2.10 requires latest dpdk version Changes for Build #434 [Miguel Duarte Barroso] Openvswitch 2.10 requires latest dpdk version [Sandro Bonazzola] ovirt-engine: add 4.2.7.z branch [Sandro Bonazzola] ovirt-engine: drop EOL release jobs ----------------- Failed Tests: ----------------- No tests ran.

Project: http://jenkins.ovirt.org/job/ovirt-system-tests_he-node-ng-suite-4.2/ Build: http://jenkins.ovirt.org/job/ovirt-system-tests_he-node-ng-suite-4.2/435/ Build Number: 435 Build Status: Still Failing Triggered By: Started by timer ------------------------------------- Changes Since Last Success: ------------------------------------- Changes for Build #432 [Miguel Duarte Barroso] Openvswitch 2.10 requires latest dpdk version Changes for Build #433 [Miguel Duarte Barroso] Openvswitch 2.10 requires latest dpdk version Changes for Build #434 [Miguel Duarte Barroso] Openvswitch 2.10 requires latest dpdk version [Sandro Bonazzola] ovirt-engine: add 4.2.7.z branch [Sandro Bonazzola] ovirt-engine: drop EOL release jobs Changes for Build #435 [Ondra Machacek] ansible-suite: Rename modules plural to singular ----------------- Failed Tests: ----------------- 1 tests failed. FAILED: 012_local_maintenance_sdk.local_maintenance Error Message: 143 -------------------- >> begin captured logging << -------------------- root: INFO: * Waiting For System Stability... root: INFO: * Performing Deactivation... root: INFO: * Performing Activation... root: INFO: * Waiting For System Stability... cli: DEBUG: signal 15 was caught --------------------- >> end captured logging << --------------------- Stack Trace: File "/usr/lib64/python2.7/unittest/case.py", line 369, in run testMethod() File "/usr/lib/python2.7/site-packages/nose/case.py", line 197, in runTest self.test(*self.arg) File "/usr/lib/python2.7/site-packages/ovirtlago/testlib.py", line 142, in wrapped_test test() File "/usr/lib/python2.7/site-packages/ovirtlago/testlib.py", line 60, in wrapper return func(get_test_prefix(), *args, **kwargs) File "/usr/lib/python2.7/site-packages/ovirtlago/testlib.py", line 79, in wrapper prefix.virt_env.engine_vm().get_api(api_ver=4), *args, **kwargs File "/usr/lib/python2.7/site-packages/ovirtlago/testlib.py", line 60, in wrapper return func(get_test_prefix(), *args, **kwargs) File "/home/jenkins/workspace/ovirt-system-tests_he-node-ng-suite-4.2/ovirt-system-tests/he-node-ng-suite-4.2/test-scenarios/012_local_maintenance_sdk.py", line 79, in local_maintenance time.sleep(wait_value) File "/usr/lib/python2.7/site-packages/lago/cmd.py", line 922, in exit_handler sys.exit(128 + signum) '143\n-------------------- >> begin captured logging << --------------------\nroot: INFO: * Waiting For System Stability...\nroot: INFO: * Performing Deactivation...\nroot: INFO: * Performing Activation...\nroot: INFO: * Waiting For System Stability...\ncli: DEBUG: signal 15 was caught\n--------------------- >> end captured logging << ---------------------'

Project: http://jenkins.ovirt.org/job/ovirt-system-tests_he-node-ng-suite-4.2/ Build: http://jenkins.ovirt.org/job/ovirt-system-tests_he-node-ng-suite-4.2/436/ Build Number: 436 Build Status: Still Failing Triggered By: Started by timer ------------------------------------- Changes Since Last Success: ------------------------------------- Changes for Build #432 [Miguel Duarte Barroso] Openvswitch 2.10 requires latest dpdk version Changes for Build #433 [Miguel Duarte Barroso] Openvswitch 2.10 requires latest dpdk version Changes for Build #434 [Miguel Duarte Barroso] Openvswitch 2.10 requires latest dpdk version [Sandro Bonazzola] ovirt-engine: add 4.2.7.z branch [Sandro Bonazzola] ovirt-engine: drop EOL release jobs Changes for Build #435 [Ondra Machacek] ansible-suite: Rename modules plural to singular Changes for Build #436 [Ondra Machacek] ansible-suite: Rename modules plural to singular ----------------- Failed Tests: ----------------- 1 tests failed. FAILED: 012_local_maintenance_sdk.local_maintenance Error Message: 143 -------------------- >> begin captured logging << -------------------- root: INFO: * Waiting For System Stability... root: INFO: * Performing Deactivation... cli: DEBUG: signal 15 was caught --------------------- >> end captured logging << --------------------- Stack Trace: File "/usr/lib64/python2.7/unittest/case.py", line 369, in run testMethod() File "/usr/lib/python2.7/site-packages/nose/case.py", line 197, in runTest self.test(*self.arg) File "/usr/lib/python2.7/site-packages/ovirtlago/testlib.py", line 142, in wrapped_test test() File "/usr/lib/python2.7/site-packages/ovirtlago/testlib.py", line 60, in wrapper return func(get_test_prefix(), *args, **kwargs) File "/usr/lib/python2.7/site-packages/ovirtlago/testlib.py", line 79, in wrapper prefix.virt_env.engine_vm().get_api(api_ver=4), *args, **kwargs File "/usr/lib/python2.7/site-packages/ovirtlago/testlib.py", line 60, in wrapper return func(get_test_prefix(), *args, **kwargs) File "/home/jenkins/workspace/ovirt-system-tests_he-node-ng-suite-4.2/ovirt-system-tests/he-node-ng-suite-4.2/test-scenarios/012_local_maintenance_sdk.py", line 65, in local_maintenance lambda: host_service.get().status == types.HostStatus.MAINTENANCE or File "/usr/lib/python2.7/site-packages/ovirtlago/testlib.py", line 286, in assert_true_within_long assert_equals_within_long(func, True, allowed_exceptions) File "/usr/lib/python2.7/site-packages/ovirtlago/testlib.py", line 273, in assert_equals_within_long func, value, LONG_TIMEOUT, allowed_exceptions=allowed_exceptions File "/usr/lib/python2.7/site-packages/ovirtlago/testlib.py", line 246, in assert_equals_within time.sleep(3) File "/usr/lib/python2.7/site-packages/lago/cmd.py", line 922, in exit_handler sys.exit(128 + signum) '143\n-------------------- >> begin captured logging << --------------------\nroot: INFO: * Waiting For System Stability...\nroot: INFO: * Performing Deactivation...\ncli: DEBUG: signal 15 was caught\n--------------------- >> end captured logging << ---------------------'

Project: http://jenkins.ovirt.org/job/ovirt-system-tests_he-node-ng-suite-4.2/ Build: http://jenkins.ovirt.org/job/ovirt-system-tests_he-node-ng-suite-4.2/437/ Build Number: 437 Build Status: Still Failing Triggered By: Started by timer ------------------------------------- Changes Since Last Success: ------------------------------------- Changes for Build #432 [Miguel Duarte Barroso] Openvswitch 2.10 requires latest dpdk version Changes for Build #433 [Miguel Duarte Barroso] Openvswitch 2.10 requires latest dpdk version Changes for Build #434 [Miguel Duarte Barroso] Openvswitch 2.10 requires latest dpdk version [Sandro Bonazzola] ovirt-engine: add 4.2.7.z branch [Sandro Bonazzola] ovirt-engine: drop EOL release jobs Changes for Build #435 [Ondra Machacek] ansible-suite: Rename modules plural to singular Changes for Build #436 [Ondra Machacek] ansible-suite: Rename modules plural to singular Changes for Build #437 [Ondra Machacek] ansible-suite: Rename modules plural to singular ----------------- Failed Tests: ----------------- 1 tests failed. FAILED: 012_local_maintenance_sdk.local_maintenance Error Message: 143 -------------------- >> begin captured logging << -------------------- root: INFO: * Waiting For System Stability... root: INFO: * Performing Deactivation... root: INFO: * Performing Activation... root: INFO: * Waiting For System Stability... cli: DEBUG: signal 15 was caught --------------------- >> end captured logging << --------------------- Stack Trace: File "/usr/lib64/python2.7/unittest/case.py", line 369, in run testMethod() File "/usr/lib/python2.7/site-packages/nose/case.py", line 197, in runTest self.test(*self.arg) File "/usr/lib/python2.7/site-packages/ovirtlago/testlib.py", line 142, in wrapped_test test() File "/usr/lib/python2.7/site-packages/ovirtlago/testlib.py", line 60, in wrapper return func(get_test_prefix(), *args, **kwargs) File "/usr/lib/python2.7/site-packages/ovirtlago/testlib.py", line 79, in wrapper prefix.virt_env.engine_vm().get_api(api_ver=4), *args, **kwargs File "/usr/lib/python2.7/site-packages/ovirtlago/testlib.py", line 60, in wrapper return func(get_test_prefix(), *args, **kwargs) File "/home/jenkins/workspace/ovirt-system-tests_he-node-ng-suite-4.2/ovirt-system-tests/he-node-ng-suite-4.2/test-scenarios/012_local_maintenance_sdk.py", line 79, in local_maintenance time.sleep(wait_value) File "/usr/lib/python2.7/site-packages/lago/cmd.py", line 922, in exit_handler sys.exit(128 + signum) '143\n-------------------- >> begin captured logging << --------------------\nroot: INFO: * Waiting For System Stability...\nroot: INFO: * Performing Deactivation...\nroot: INFO: * Performing Activation...\nroot: INFO: * Waiting For System Stability...\ncli: DEBUG: signal 15 was caught\n--------------------- >> end captured logging << ---------------------'

Project: http://jenkins.ovirt.org/job/ovirt-system-tests_he-node-ng-suite-4.2/ Build: http://jenkins.ovirt.org/job/ovirt-system-tests_he-node-ng-suite-4.2/438/ Build Number: 438 Build Status: Still Failing Triggered By: Started by timer ------------------------------------- Changes Since Last Success: ------------------------------------- Changes for Build #432 [Miguel Duarte Barroso] Openvswitch 2.10 requires latest dpdk version Changes for Build #433 [Miguel Duarte Barroso] Openvswitch 2.10 requires latest dpdk version Changes for Build #434 [Miguel Duarte Barroso] Openvswitch 2.10 requires latest dpdk version [Sandro Bonazzola] ovirt-engine: add 4.2.7.z branch [Sandro Bonazzola] ovirt-engine: drop EOL release jobs Changes for Build #435 [Ondra Machacek] ansible-suite: Rename modules plural to singular Changes for Build #436 [Ondra Machacek] ansible-suite: Rename modules plural to singular Changes for Build #437 [Ondra Machacek] ansible-suite: Rename modules plural to singular Changes for Build #438 [Ondra Machacek] ansible-suite: Rename modules plural to singular ----------------- Failed Tests: ----------------- 1 tests failed. FAILED: 012_local_maintenance_sdk.local_maintenance Error Message: 143 -------------------- >> begin captured logging << -------------------- root: INFO: * Waiting For System Stability... root: INFO: * Performing Deactivation... root: INFO: * Performing Activation... root: INFO: * Waiting For System Stability... cli: DEBUG: signal 15 was caught --------------------- >> end captured logging << --------------------- Stack Trace: File "/usr/lib64/python2.7/unittest/case.py", line 369, in run testMethod() File "/usr/lib/python2.7/site-packages/nose/case.py", line 197, in runTest self.test(*self.arg) File "/usr/lib/python2.7/site-packages/ovirtlago/testlib.py", line 142, in wrapped_test test() File "/usr/lib/python2.7/site-packages/ovirtlago/testlib.py", line 60, in wrapper return func(get_test_prefix(), *args, **kwargs) File "/usr/lib/python2.7/site-packages/ovirtlago/testlib.py", line 79, in wrapper prefix.virt_env.engine_vm().get_api(api_ver=4), *args, **kwargs File "/usr/lib/python2.7/site-packages/ovirtlago/testlib.py", line 60, in wrapper return func(get_test_prefix(), *args, **kwargs) File "/home/jenkins/workspace/ovirt-system-tests_he-node-ng-suite-4.2/ovirt-system-tests/he-node-ng-suite-4.2/test-scenarios/012_local_maintenance_sdk.py", line 79, in local_maintenance time.sleep(wait_value) File "/usr/lib/python2.7/site-packages/lago/cmd.py", line 922, in exit_handler sys.exit(128 + signum) '143\n-------------------- >> begin captured logging << --------------------\nroot: INFO: * Waiting For System Stability...\nroot: INFO: * Performing Deactivation...\nroot: INFO: * Performing Activation...\nroot: INFO: * Waiting For System Stability...\ncli: DEBUG: signal 15 was caught\n--------------------- >> end captured logging << ---------------------'

Project: http://jenkins.ovirt.org/job/ovirt-system-tests_he-node-ng-suite-4.2/ Build: http://jenkins.ovirt.org/job/ovirt-system-tests_he-node-ng-suite-4.2/439/ Build Number: 439 Build Status: Still Failing Triggered By: Started by timer ------------------------------------- Changes Since Last Success: ------------------------------------- Changes for Build #432 [Miguel Duarte Barroso] Openvswitch 2.10 requires latest dpdk version Changes for Build #433 [Miguel Duarte Barroso] Openvswitch 2.10 requires latest dpdk version Changes for Build #434 [Miguel Duarte Barroso] Openvswitch 2.10 requires latest dpdk version [Sandro Bonazzola] ovirt-engine: add 4.2.7.z branch [Sandro Bonazzola] ovirt-engine: drop EOL release jobs Changes for Build #435 [Ondra Machacek] ansible-suite: Rename modules plural to singular Changes for Build #436 [Ondra Machacek] ansible-suite: Rename modules plural to singular Changes for Build #437 [Ondra Machacek] ansible-suite: Rename modules plural to singular Changes for Build #438 [Ondra Machacek] ansible-suite: Rename modules plural to singular Changes for Build #439 [Ondra Machacek] ansible-suite: Rename modules plural to singular ----------------- Failed Tests: ----------------- 1 tests failed. FAILED: 012_local_maintenance_sdk.local_maintenance Error Message: 143 -------------------- >> begin captured logging << -------------------- root: INFO: * Waiting For System Stability... root: INFO: * Performing Deactivation... root: INFO: * Performing Activation... root: INFO: * Waiting For System Stability... cli: DEBUG: signal 15 was caught --------------------- >> end captured logging << --------------------- Stack Trace: File "/usr/lib64/python2.7/unittest/case.py", line 369, in run testMethod() File "/usr/lib/python2.7/site-packages/nose/case.py", line 197, in runTest self.test(*self.arg) File "/usr/lib/python2.7/site-packages/ovirtlago/testlib.py", line 142, in wrapped_test test() File "/usr/lib/python2.7/site-packages/ovirtlago/testlib.py", line 60, in wrapper return func(get_test_prefix(), *args, **kwargs) File "/usr/lib/python2.7/site-packages/ovirtlago/testlib.py", line 79, in wrapper prefix.virt_env.engine_vm().get_api(api_ver=4), *args, **kwargs File "/usr/lib/python2.7/site-packages/ovirtlago/testlib.py", line 60, in wrapper return func(get_test_prefix(), *args, **kwargs) File "/home/jenkins/workspace/ovirt-system-tests_he-node-ng-suite-4.2/ovirt-system-tests/he-node-ng-suite-4.2/test-scenarios/012_local_maintenance_sdk.py", line 79, in local_maintenance time.sleep(wait_value) File "/usr/lib/python2.7/site-packages/lago/cmd.py", line 922, in exit_handler sys.exit(128 + signum) '143\n-------------------- >> begin captured logging << --------------------\nroot: INFO: * Waiting For System Stability...\nroot: INFO: * Performing Deactivation...\nroot: INFO: * Performing Activation...\nroot: INFO: * Waiting For System Stability...\ncli: DEBUG: signal 15 was caught\n--------------------- >> end captured logging << ---------------------'

Project: http://jenkins.ovirt.org/job/ovirt-system-tests_he-node-ng-suite-4.2/ Build: http://jenkins.ovirt.org/job/ovirt-system-tests_he-node-ng-suite-4.2/440/ Build Number: 440 Build Status: Fixed Triggered By: Started by timer ------------------------------------- Changes Since Last Success: ------------------------------------- Changes for Build #432 [Miguel Duarte Barroso] Openvswitch 2.10 requires latest dpdk version Changes for Build #433 [Miguel Duarte Barroso] Openvswitch 2.10 requires latest dpdk version Changes for Build #434 [Miguel Duarte Barroso] Openvswitch 2.10 requires latest dpdk version [Sandro Bonazzola] ovirt-engine: add 4.2.7.z branch [Sandro Bonazzola] ovirt-engine: drop EOL release jobs Changes for Build #435 [Ondra Machacek] ansible-suite: Rename modules plural to singular Changes for Build #436 [Ondra Machacek] ansible-suite: Rename modules plural to singular Changes for Build #437 [Ondra Machacek] ansible-suite: Rename modules plural to singular Changes for Build #438 [Ondra Machacek] ansible-suite: Rename modules plural to singular Changes for Build #439 [Ondra Machacek] ansible-suite: Rename modules plural to singular Changes for Build #440 [Ondra Machacek] ansible-suite: Rename modules plural to singular ----------------- Failed Tests: ----------------- All tests passed
participants (1)
-
jenkins@jenkins.phx.ovirt.org