Build failed in Jenkins: system-sync_mirrors-centos-appstream-el8-x86_64 #10

See <https://jenkins.ovirt.org/job/system-sync_mirrors-centos-appstream-el8-x86_64/10/display/redirect?page=changes> Changes: [Evgeny Slutsky] Add eslutsky@redhat.com to jenkins Recipient lists. [Sandro Bonazzola] ovirt-engine: drop jobs for legacy versions [Shlomi] Added ability to ignore other repos when sync_mirror runs [Evgheni Dereveanchin] Remove ACME annotations from TLS routes [Sandro Bonazzola] mirrors: drop gluster 3 mirrors [Sandro Bonazzola] cleanup: drop gluster7 dismissed repos mirroring [Shlomi] Added ability to generate an HTML report, containing all repos [Lev Veyde] Fixed the deprecated --old-chroot option issue [Evgheni Dereveanchin] remove fc29 mirror sync jobs [Ehud Yonasi] change_queue: disable tests for CQ. [Evgheni Dereveanchin] Download all package versions for modular repos [Shlomi] Modified alert_old_patches to post additional info [Ehud Yonasi] ost_nightly: added jobs for nightly tests. [Evgheni Dereveanchin] Bump el7 mirror snapshots [Ehud Yonasi] stdci_runner: add node label for templates. [Ehud Yonasi] mock: fix yum repos injection. [Ehud Yonasi] onboard ost-images to stdci. [Ehud Yonasi] stdci_runner: update templates node to ost-images. [Ehud Yonasi] poll: add ost-images to nightly. [Sandro Bonazzola] Revert "ovirt-release: run only on fc29 nodes" [arachmani] Add arachman@redhat.com to jenkins recipient lists [Evgheni Dereveanchin] Do not run jenkins check-patch job on fc29 [Gal Ben Haim] Add gcc to fcraw [Sandro Bonazzola] pipelines: add ovirt-dependencies [Evgheni Dereveanchin] do not expand values in run_oc_playbook [Gal Ben Haim] pusher: Fix 'if_not_exists' type [Gal Ben Haim] Add common_cli module [Gal Ben Haim] Use common CLI for the usrc updater [Gal Ben Haim] Add common CLI for updaters [Gal Ben Haim] Simplify usrc_updater [Gal Ben Haim] Share common tasks between updaters [Gal Ben Haim] dockerfile_utils: Fix error handling [Gal Ben Haim] dockerfile_utils: Inject SHA sums [Sandro Bonazzola] ovirt-engine_coverity-analysis: fix git_proto [Sandro Bonazzola] template: ovirt-engine_coverity-analysis: fix git_proto [Ehud Yonasi] global_setup: enable el8 setup. [Barak Korren] usrc: Support *.yml files [Roy Golan] Removing rgolan@redhat.com from email notifs [Sandro Bonazzola] ovirt-guest-agent: drop fc30 [Ehud Yonasi] mock_configs: added rhel configs. [Tristan Cacqueray] zuul-jobs-gate: repparent to base-gate-job [Ehud Yonasi] stdci_runner: added the rhel labels selection. [Barak Korren] Dropped FCRAW tests for STDCI [Barak Korren] usrc: expand test for 'files' provider [Barak Korren] usrc: Filtering for the `files` provider [Ehud Yonasi] poll: remove metrics job. [Gal Ben Haim] dockerfile-utils: Better handling for nested repos [Ori Liel] Migrate model, metamodel projects to STDCIv2 [Gal Ben Haim] dockerfile-utils: Specify authfile [Gal Ben Haim] dockerfile-utils: Skopeo change args order [Gal Ben Haim] mock: Pass Docker conf env var [Gal Ben Haim] dockefile-utils: Unset env var in skopeo test [Ehud Yonasi] centos7-nodes: updated el7 mirrors links. [Evgheni Dereveanchin] Change logic for module metadata detection ------------------------------------------ [...truncated 98.97 KB...] (93/303): perl-ExtUtils-Embed-1.33-404.module_el8.1.0+229+ | 76 kB 00:00 (97/303): perl-Encode-deve 37% [====== ] 27 MB/s | 91 MB 00:05 ETA (94/303): perl-ExtUtils-CBuilder-0.280225-367.module_el8.1 | 48 kB 00:00 (95/303): perl-Encode-devel-2.88-7.module_el8.1.0+229+cd13 | 38 kB 00:00 (96/303): perl-ExtUtils-Install-2.04-368.module_el8.1.0+22 | 46 kB 00:00 (97/303): perl-ExtUtils-Miniperl-1.05-404.module_el8.1.0+2 | 73 kB 00:00 (98/303): perl-ExtUtils-Manifest-1.70-395.el8.noarch.rpm | 37 kB 00:00 (99/303): perl-ExtUtils-MakeMaker-7.24-4.module_el8.1.0+22 | 296 kB 00:00 (100/303): perl-ExtUtils-MM-Utils-7.24-4.module_el8.1.0+22 | 16 kB 00:00 (101/303): perl-ExtUtils-ParseXS-3.31-369.module_el8.1.0+2 | 82 kB 00:00 (102/303): perl-Devel-Peek-1.23-404.module_el8.1.0+229+cd1 | 90 kB 00:00 (103/303): perl-FCGI-0.78-11.module_el8.1.0+205+ccfc4274.x | 49 kB 00:00 (104/303): perl-DB_File-1.842-1.el8.x86_64.rpm | 83 kB 00:00 (105/303): perl-File-Fetch-0.56-2.el8.noarch.rpm | 33 kB 00:00 (106/303): perl-File-Which-1.21-4.module_el8.1.0+229+cd132 | 23 kB 00:00 (107/303): perl-File-HomeDir-1.00-14.module_el8.1.0+229+cd | 62 kB 00:00 (108/303): perl-Fedora-VSP-0.001-9.el8.noarch.rpm | 24 kB 00:00 (109/303): perl-File-pushd-1.014-6.module_el8.1.0+241+b7d3 | 27 kB 00:00 (110/303): perl-Filter-1.58-2.el8.x86_64.rpm | 82 kB 00:00 (115/303): perl-IO-Zlib-1. 38% [====== ] 25 MB/s | 93 MB 00:05 ETA (111/303): perl-IO-Compress-2.074-2.module_el8.1.0+229+cd1 | 257 kB 00:00 (112/303): perl-IPC-Cmd-0.98-2.module_el8.1.0+229+cd132df8 | 43 kB 00:00 (113/303): perl-Filter-Simple-0.92-367.module_el8.1.0+229+ | 28 kB 00:00 (114/303): perl-IPC-SysV-2.07-397.el8.x86_64.rpm | 43 kB 00:00 (115/303): perl-IPC-System-Simple-1.25-17.el8.noarch.rpm | 43 kB 00:00 (116/303): perl-JSON-PP-2.94000-2.module_el8.1.0+229+cd132 | 67 kB 00:00 (117/303): perl-Locale-Codes-3.42-3.module_el8.1.0+229+cd1 | 302 kB 00:00 (118/303): perl-Locale-Maketext-1.28-396.el8.noarch.rpm | 99 kB 00:00 (119/303): perl-Locale-Maketext-Simple-0.21-404.module_el8 | 76 kB 00:00 (120/303): perl-MRO-Compat-0.13-4.el8.noarch.rpm | 24 kB 00:00 (121/303): perl-Math-BigInt-FastCalc-0.500.600-6.el8.x86_6 | 27 kB 00:00 (122/303): perl-IO-Socket-IP-0.39-5.el8.noarch.rpm | 47 kB 00:00 (127/303): perl-Module-Bui 38% [====== ] 24 MB/s | 94 MB 00:06 ETA (123/303): perl-Math-BigRat-0.2614-1.el8.noarch.rpm | 40 kB 00:00 (124/303): perl-Module-Build-0.42.24-5.el8.noarch.rpm | 273 kB 00:00 (125/303): perl-Module-CoreList-5.20180414-2.module_el8.1. | 85 kB 00:00 (126/303): perl-IO-Zlib-1.10-404.module_el8.1.0+229+cd132d | 77 kB 00:00 (127/303): perl-Memoize-1.03-404.module_el8.1.0+229+cd132d | 115 kB 00:00 (132/303): perl-Module-Loa 38% [====== ] 22 MB/s | 95 MB 00:06 ETA (128/303): perl-Module-CPANfile-1.1002-7.module_el8.1.0+24 | 42 kB 00:00 (129/303): perl-Module-Load-0.32-395.el8.noarch.rpm | 19 kB 00:00 (130/303): perl-Module-Load-Conditional-0.68-395.el8.noarc | 24 kB 00:00 (131/303): perl-Module-CoreList-tools-5.20180414-2.module_ | 21 kB 00:00 (132/303): perl-Package-Generator-1.106-11.el8.noarch.rpm | 27 kB 00:00 (133/303): perl-Module-Metadata-1.000033-395.el8.noarch.rp | 44 kB 00:00 (134/303): perl-Net-Ping-2.43-404.module_el8.1.0+229+cd132 | 92 kB 00:00 (135/303): perl-Params-Check-0.38-395.el8.noarch.rpm | 24 kB 00:00 (136/303): perl-Params-Util-1.07-22.el8.x86_64.rpm | 44 kB 00:00 (137/303): perl-Parse-PMFile-0.41-7.module_el8.1.0+241+b7d | 24 kB 00:00 (138/303): perl-Pod-Checker-1.73-395.el8.noarch.rpm | 33 kB 00:00 (139/303): perl-PerlIO-via-QuotedPrint-0.08-395.el8.noarch | 13 kB 00:00 (140/303): perl-Pod-Html-1.22.01-404.module_el8.1.0+229+cd | 84 kB 00:00 (141/303): perl-Pod-Parser-1.63-396.el8.noarch.rpm | 108 kB 00:00 (142/303): perl-String-ShellQuote-1.04-24.module_el8.1.0+2 | 23 kB 00:00 (143/303): perl-SelfLoader-1.23-404.module_el8.1.0+229+cd1 | 80 kB 00:00 (144/303): perl-Sub-Exporter-0.987-15.el8.noarch.rpm | 73 kB 00:00 (149/303): perl-Sys-Syslog 39% [====== ] 21 MB/s | 96 MB 00:06 ETA (145/303): perl-Sub-Install-0.928-14.el8.noarch.rpm | 27 kB 00:00 (146/303): perl-Sys-Syslog-0.35-397.el8.x86_64.rpm | 50 kB 00:00 (147/303): perl-Test-1.28-404.module_el8.1.0+229+cd132df8. | 87 kB 00:00 (148/303): perl-Software-License-0.103012-5.module_el8.1.0 | 127 kB 00:00 (149/303): perl-Module-Loaded-0.08-404.module_el8.1.0+229+ | 71 kB 00:00 (150/303): perl-Text-Balanced-2.03-395.el8.noarch.rpm | 58 kB 00:00 (151/303): perl-Text-Diff-1.44-4.module_el8.1.0+229+cd132d | 45 kB 00:00 (152/303): perl-Text-Glob-0.11-4.el8.noarch.rpm | 17 kB 00:00 (153/303): perl-Thread-Queue-3.13-1.el8.noarch.rpm | 24 kB 00:00 (154/303): perl-Time-HiRes-1.9753-2.module_el8.1.0+229+cd1 | 59 kB 00:00 (155/303): perl-Test-Simple-1.302086-2.module_el8.1.0+229+ | 429 kB 00:00 (156/303): perl-bignum-0.49-2.el8.noarch.rpm | 44 kB 00:00 (157/303): perl-YAML-1.24-3.module_el8.1.0+230+dfa6fed6.no | 92 kB 00:00 (158/303): perl-autodie-2.29-396.el8.noarch.rpm | 98 kB 00:00 (159/303): perl-Time-Piece-1.31-404.module_el8.1.0+229+cd1 | 95 kB 00:00 (160/303): perl-URI-1.71-7.module_el8.1.0+229+cd132df8.noa | 117 kB 00:00 (166/303): perl-experiment 39% [====== ] 20 MB/s | 97 MB 00:07 ETA (161/303): perl-devel-5.24.4-404.module_el8.1.0+229+cd132d | 581 kB 00:00 (162/303): perl-generators-1.10-9.el8.noarch.rpm | 18 kB 00:00 (163/303): perl-inc-latest-0.500-9.el8.noarch.rpm | 25 kB 00:00 (164/303): perl-experimental-0.019-2.el8.noarch.rpm | 24 kB 00:00 (165/303): perl-Unicode-Collate-1.20-2.module_el8.1.0+229+ | 677 kB 00:00 (166/303): perl-encoding-2.19-7.module_el8.1.0+229+cd132df | 66 kB 00:00 (167/303): perl-libnet-3.11-3.el8.noarch.rpm | 121 kB 00:00 (168/303): perl-Test-Harness-3.42-1.el8.noarch.rpm | 279 kB 00:00 (169/303): perl-libnetcfg-5.24.4-404.module_el8.1.0+229+cd | 74 kB 00:00 (170/303): perl-local-lib-2.000023-2.module_el8.1.0+229+cd | 74 kB 00:00 (171/303): perl-utils-5.24.4-404.module_el8.1.0+229+cd132d | 142 kB 00:00 (172/303): perl-version-0.99.24-1.el8.x86_64.rpm | 67 kB 00:00 (173/303): perl-perlfaq-5.20180605-1.el8.noarch.rpm | 386 kB 00:00 (179/303): php-cli-7.2.24- 40% [======- ] 19 MB/s | 100 MB 00:07 ETA (174/303): php-bcmath-7.2.24-1.module_el8.2.0+313+b04d0a66 | 79 kB 00:00 (175/303): php-cli-7.2.24-1.module_el8.2.0+313+b04d0a66.x8 | 3.1 MB 00:00 (176/303): perl-open-1.10-404.module_el8.1.0+229+cd132df8. | 74 kB 00:00 (177/303): php-dba-7.2.24-1.module_el8.2.0+313+b04d0a66.x8 | 78 kB 00:00 (183/303): php-devel-7.2.2 42% [======- ] 19 MB/s | 103 MB 00:07 ETA (178/303): php-dbg-7.2.24-1.module_el8.2.0+313+b04d0a66.x8 | 1.6 MB 00:00 (179/303): php-7.2.24-1.module_el8.2.0+313+b04d0a66.x86_64 | 1.5 MB 00:00 (180/303): php-common-7.2.24-1.module_el8.2.0+313+b04d0a66 | 661 kB 00:00 (181/303): php-devel-7.2.24-1.module_el8.2.0+313+b04d0a66. | 712 kB 00:00 (182/303): php-enchant-7.2.24-1.module_el8.2.0+313+b04d0a6 | 63 kB 00:00 (183/303): php-gmp-7.2.24-1.module_el8.2.0+313+b04d0a66.x8 | 75 kB 00:00 (184/303): perl-tests-5.24.4-404.module_el8.1.0+229+cd132d | 1.2 MB 00:00 (185/303): php-fpm-7.2.24-1.module_el8.2.0+313+b04d0a66.x8 | 1.6 MB 00:00 (186/303): containernetwor 45% [======= ] 19 MB/s | 111 MB 00:06 ETA (186/303): php-json-7.2.24-1.module_el8.2.0+313+b04d0a66.x | 73 kB 00:00 (187/303): php-ldap-7.2.24-1.module_el8.2.0+313+b04d0a66.x | 79 kB 00:00 (188/303): php-embedded-7.2.24-1.module_el8.2.0+313+b04d0a | 1.5 MB 00:00 (189/303): php-mbstring-7.2.24-1.module_el8.2.0+313+b04d0a | 580 kB 00:00 (190/303): php-mysqlnd-7.2.24-1.module_el8.2.0+313+b04d0a6 | 190 kB 00:00 (191/303): php-odbc-7.2.24-1.module_el8.2.0+313+b04d0a66.x | 88 kB 00:00 (192/303): php-intl-7.2.24-1.module_el8.2.0+313+b04d0a66.x | 192 kB 00:00 (193/303): php-pdo-7.2.24-1.module_el8.2.0+313+b04d0a66.x8 | 122 kB 00:00 (194/303): php-gd-7.2.24-1.module_el8.2.0+313+b04d0a66.x86 | 84 kB 00:00 (195/303): php-pecl-apcu-devel-5.1.12-2.module_el8.2.0+313 | 46 kB 00:00 (196/303): php-pecl-apcu-5.1.12-2.module_el8.2.0+313+b04d0 | 65 kB 00:00 (197/303): php-pecl-zip-1.15.3-1.module_el8.2.0+313+b04d0a | 51 kB 00:00 (198/303): php-pear-1.10.5-9.module_el8.2.0+313+b04d0a66.n | 358 kB 00:00 (199/303): containernetwor 46% [=======- ] 18 MB/s | 114 MB 00:06 ETA (199/303): php-recode-7.2.24-1.module_el8.2.0+313+b04d0a66 | 59 kB 00:00 (200/303): php-xml-7.2.24-1.module_el8.2.0+313+b04d0a66.x8 | 188 kB 00:00 (201/303): php-process-7.2.24-1.module_el8.2.0+313+b04d0a6 | 84 kB 00:00 (202/303): php-pgsql-7.2.24-1.module_el8.2.0+313+b04d0a66. | 117 kB 00:00 (203/303): php-snmp-7.2.24-1.module_el8.2.0+313+b04d0a66.x | 74 kB 00:00 (204/303): php-xmlrpc-7.2.24-1.module_el8.2.0+313+b04d0a66 | 89 kB 00:00 (205/303): plexus-cipher-1.7-14.module_el8.0.0+39+6a9b6e22 | 29 kB 00:00 (206/303): plexus-classworlds-2.5.2-9.module_el8.0.0+39+6a | 65 kB 00:00 (207/303): plexus-containers-component-annotations-1.7.1-8 | 24 kB 00:00 (208/303): plexus-interpolation-1.22-9.module_el8.0.0+39+6 | 79 kB 00:00 (209/303): plexus-sec-dispatcher-1.4-26.module_el8.0.0+39+ | 37 kB 00:00 (210/303): plexus-utils-3.1.0-3.module_el8.0.0+39+6a9b6e22 | 259 kB 00:00 (211/303): podman-docker-1.0.0-4.git921f98f.module_el8.2.0 | 28 kB 00:00 (212/303): podman-docker-1.6.4-10.module_el8.2.0+305+5e198 | 36 kB 00:00 (213/303): containernetwor 47% [=======- ] 18 MB/s | 116 MB 00:07 ETA (213/303): podman-tests-1.6.4-10.module_el8.2.0+305+5e198a | 47 kB 00:00 (214/303): php-opcache-7.2.24-1.module_el8.2.0+313+b04d0a6 | 231 kB 00:00 (215/303): php-soap-7.2.24-1.module_el8.2.0+313+b04d0a66.x | 177 kB 00:00 (216/303): postgresql-10.14-1.module_el8.2.0+487+53cc39ce. | 1.5 MB 00:00 (217/303): postgresql-9.6.10-1.module_el8.0.0+16+7a9f6089. | 1.4 MB 00:00 (218/303): containernetwor 50% [======== ] 18 MB/s | 123 MB 00:06 ETA (218/303): postgresql-contrib-9.6.10-1.module_el8.0.0+16+7 | 754 kB 00:00 (219/303): postgresql-contrib-10.14-1.module_el8.2.0+487+5 | 804 kB 00:00 (220/303): postgresql-plperl-9.6.10-1.module_el8.0.0+16+7a | 101 kB 00:00 (221/303): postgresql-plperl-10.14-1.module_el8.2.0+487+53 | 102 kB 00:00 (222/303): postgresql-plpython3-9.6.10-1.module_el8.0.0+16 | 117 kB 00:00 (223/303): podman-1.6.4-10.module_el8.2.0+305+5e198a41.x86 | 12 MB 00:00 (225/303): podman-1.0.0-4. 59% [=========- ] 21 MB/s | 145 MB 00:04 ETA (224/303): podman-remote-1.6.4-10.module_el8.2.0+305+5e198 | 11 MB 00:00 (225/303): postgresql-pltcl-9.6.10-1.module_el8.0.0+16+7a9 | 80 kB 00:00 (226/303): postgresql-plpython3-10.14-1.module_el8.2.0+487 | 121 kB 00:00 (227/303): postgresql-docs-10.14-1.module_el8.2.0+487+53cc | 9.0 MB 00:00 (229/303): podman-1.0.0-4. 64% [========== ] 22 MB/s | 158 MB 00:03 ETA (228/303): postgresql-pltcl-10.14-1.module_el8.2.0+487+53c | 78 kB 00:00 (229/303): postgresql-server-devel-9.6.10-1.module_el8.0.0 | 1.0 MB 00:00 (230/303): postgresql-static-9.6.10-1.module_el8.0.0+16+7a | 86 kB 00:00 (231/303): postgresql-server-10.14-1.module_el8.2.0+487+53 | 5.0 MB 00:00 (232/303): postgresql-server-devel-10.14-1.module_el8.2.0+ | 1.1 MB 00:00 (233/303): postgresql-test-rpm-macros-9.6.10-1.module_el8. | 48 kB 00:00 (235/303): podman-1.0.0-4. 69% [=========== ] 23 MB/s | 168 MB 00:03 ETA (234/303): postgresql-test-9.6.10-1.module_el8.0.0+16+7a9f | 1.5 MB 00:00 (235/303): postgresql-test-10.14-1.module_el8.2.0+487+53cc | 1.7 MB 00:00 (236/303): postgresql-static-10.14-1.module_el8.2.0+487+53 | 125 kB 00:00 (237/303): python-nose-docs-1.3.7-30.module_el8.1.0+245+c3 | 48 kB 00:00 (238/303): postgresql-upgrade-devel-10.14-1.module_el8.2.0 | 760 kB 00:00 (239/303): postgresql-server-9.6.10-1.module_el8.0.0+16+7a | 5.0 MB 00:00 (242/303): postgresql-docs 73% [===========- ] 23 MB/s | 179 MB 00:02 ETA (240/303): postgresql-upgrade-10.14-1.module_el8.2.0+487+5 | 3.4 MB 00:00 (241/303): python3-criu-3.12-9.module_el8.2.0+303+1105185b | 157 kB 00:00 (242/303): python-podman-api-1.2.0-0.2.gitd0a45fe.module_e | 43 kB 00:00 (243/303): python-sqlalchemy-doc-1.3.2-1.module_el8.1.0+24 | 2.1 MB 00:00 (244/303): python3-jwcrypto-0.5.0-1.module_el8.2.0+370+b14 | 66 kB 00:00 (245/303): python3-ipaclient-4.8.4-7.module_el8.2.0+370+b1 | 661 kB 00:00 (246/303): python3-ipalib-4.8.4-7.module_el8.2.0+370+b142e | 707 kB 00:00 (247/303): python3-qrcode-5.1-12.module_el8.2.0+370+b142e1 | 17 kB 00:00 (250/303): postgresql-docs 77% [============ ] 23 MB/s | 189 MB 00:02 ETA (248/303): python3-qrcode-core-5.1-12.module_el8.2.0+370+b | 46 kB 00:00 (249/303): python3-yubico-1.3.2-9.module_el8.2.0+370+b142e | 63 kB 00:00 (250/303): python3-pyusb-1.0.0-9.module_el8.2.0+370+b142e1 | 88 kB 00:00 (251/303): ruby-devel-2.5.5-105.module_el8.1.0+214+9be47fd | 126 kB 00:00 (252/303): ruby-2.5.5-105.module_el8.1.0+214+9be47fd7.i686 | 86 kB 00:00 (253/303): ruby-2.5.5-105.module_el8.1.0+214+9be47fd7.x86_ | 86 kB 00:00 (254/303): ruby-devel-2.5.5-105.module_el8.1.0+214+9be47fd | 126 kB 00:00 (255/303): python3-criu-3.12-9.module_el8.2.0+304+65a3c2ac | 157 kB 00:00 (256/303): rubygem-abrt-0.3.0-4.module_el8.1.0+214+9be47fd | 14 kB 00:00 (259/303): postgresql-docs 80% [============- ] 23 MB/s | 196 MB 00:02 ETA (257/303): ruby-libs-2.5.5-105.module_el8.1.0+214+9be47fd7 | 3.0 MB 00:00 (258/303): postgresql-docs-9.6.10-1.module_el8.0.0+16+7a9f | 11 MB 00:02 (259/303): ruby-doc-2.5.5-105.module_el8.1.0+214+9be47fd7. | 5.4 MB 00:00 (260/303): ruby-libs-2.5.5-105.module_el8.1.0+214+9be47fd7 | 2.9 MB 00:00 (261/303): podman-1.0.0-4.git921f98f.module_el8.2.0+303+11 | 9.5 MB 00:03 (265/303): rubygem-bigdeci 86% [=============- ] 23 MB/s | 211 MB 00:01 ETA (262/303): rubygem-abrt-doc-0.3.0-4.module_el8.1.0+214+9be | 230 kB 00:00 (263/303): rubygem-bigdecimal-1.3.4-105.module_el8.1.0+214 | 100 kB 00:00 (264/303): rubygem-bigdecimal-1.3.4-105.module_el8.1.0+214 | 97 kB 00:00 (265/303): rubygem-io-console-0.4.6-105.module_el8.1.0+214 | 67 kB 00:00 (266/303): rubygem-did_you_mean-1.2.0-105.module_el8.1.0+2 | 90 kB 00:00 (267/303): rubygem-json-2.1.0-105.module_el8.1.0+214+9be47 | 92 kB 00:00 (268/303): rubygem-io-console-0.4.6-105.module_el8.1.0+214 | 66 kB 00:00 (269/303): rubygem-json-2.1.0-105.module_el8.1.0+214+9be47 | 90 kB 00:00 (270/303): rubygem-bundler-1.16.1-3.module_el8.1.0+214+9be | 352 kB 00:00 (271/303): rubygem-mongo-2.5.1-2.module_el8.1.0+214+9be47f | 186 kB 00:00 (272/303): rubygem-mysql2-0.4.10-4.module_el8.1.0+214+9be4 | 46 kB 00:00 (273/303): rubygem-minitest-5.10.3-105.module_el8.1.0+214+ | 122 kB 00:00 (274/303): rubygem-bson-4.3.0-2.module_el8.1.0+214+9be47fd | 55 kB 00:00 (275/303): rubygem-mysql2-doc-0.4.10-4.module_el8.1.0+214+ | 307 kB 00:00 (276/303): rubygem-net-telnet-0.1.1-105.module_el8.1.0+214 | 70 kB 00:00 (277/303): rubygem-pg-1.0.0-2.module_el8.1.0+214+9be47fd7. | 88 kB 00:00 (278/303): rubygem-openssl-2.1.2-105.module_el8.1.0+214+9b | 202 kB 00:00 (279/303): rubygem-openssl-2.1.2-105.module_el8.1.0+214+9b | 190 kB 00:00 (280/303): rubygem-bson-doc-4.3.0-2.module_el8.1.0+214+9be | 406 kB 00:00 (281/303): rubygem-power_assert-1.1.1-105.module_el8.1.0+2 | 69 kB 00:00 (282/303): rubygem-psych-3.0.2-105.module_el8.1.0+214+9be4 | 96 kB 00:00 (283/303): rubygem-pg-doc-1.0.0-2.module_el8.1.0+214+9be47 | 555 kB 00:00 (284/303): rubygem-psych-3.0.2-105.module_el8.1.0+214+9be4 | 95 kB 00:00 (288/303): rubygem-rdoc-6. 88% [============== ] 21 MB/s | 215 MB 00:01 ETA (285/303): rubygem-rake-12.3.0-105.module_el8.1.0+214+9be4 | 139 kB 00:00 (286/303): rubygems-devel-2.7.6.2-105.module_el8.1.0+214+9 | 60 kB 00:00 (287/303): rubygem-rdoc-6.0.1-105.module_el8.1.0+214+9be47 | 486 kB 00:00 (288/303): rubygem-xmlrpc-0.3.0-105.module_el8.1.0+214+9be | 81 kB 00:00 (289/303): rubygem-mongo-doc-2.5.1-2.module_el8.1.0+214+9b | 1.2 MB 00:00 (290/303): rubygems-2.7.6.2-105.module_el8.1.0+214+9be47fd | 308 kB 00:00 (291/303): skopeo-tests-0.1.40-9.module_el8.2.0+378+19727d | 33 kB 00:00 (292/303): slf4j-1.7.25-4.module_el8.0.0+39+6a9b6e22.noarc | 77 kB 00:00 (293/303): slf4j-1.7.25-4.module_el8.2.0+315+896aef55.noar | 77 kB 00:00 (298/303): skopeo-0.1.32-4 89% [============== ] 20 MB/s | 217 MB 00:01 ETA (294/303): slirp4netns-0.1-5.dev.gitc4e1bc5.module_el8.2.0 | 55 kB 00:00 (295/303): rubygem-test-unit-3.2.7-105.module_el8.1.0+214+ | 182 kB 00:00 (296/303): slirp4netns-0.4.2-3.git21fdece.module_el8.2.0+3 | 88 kB 00:00 (297/303): runc-1.0.0-64.rc10.module_el8.2.0+304+65a3c2ac. | 2.7 MB 00:00 (298/303): udica-0.2.1-2.module_el8.2.0+304+65a3c2ac.noarc | 48 kB 00:00 (299/303): runc-1.0.0-56.rc5.dev.git2abd837.module_el8.2.0 | 2.5 MB 00:00 (300/303): toolbox-0.0.7-1.module_el8.2.0+304+65a3c2ac.noa | 15 kB 00:00 (301/303): containernetwor 91% [==============- ] 20 MB/s | 224 MB 00:01 ETA (301/303): skopeo-0.1.32-4.git1715c90.module_el8.2.0+303+1 | 5.2 MB 00:00 (302/303): containernetwor 94% [=============== ] 20 MB/s | 230 MB 00:00 ETA (302/303): containernetwor 94% [=============== ] 19 MB/s | 231 MB 00:00 ETA (303/303): skopeo-0.1.40-9 95% [=============== ] 18 MB/s | 233 MB 00:00 ETA (303/303): skopeo-0.1.40-9 96% [=============== ] 17 MB/s | 234 MB 00:00 ETA (302/303): skopeo-0.1.40-9.module_el8.2.0+378+19727d8d.x86 | 5.8 MB 00:02 (303/303): containernetwor 96% [=============== ] 16 MB/s | 235 MB 00:00 ETA (303/303): containernetwor 96% [=============== ] 15 MB/s | 235 MB 00:00 ETA (303/303): containernetwor 96% [=============== ] 14 MB/s | 236 MB 00:00 ETA (303/303): containernetwor 96% [=============== ] 13 MB/s | 236 MB 00:00 ETA (303/303): containernetwor 96% [===============-] 12 MB/s | 236 MB 00:00 ETA (303/303): containernetwor 97% [===============-] 12 MB/s | 237 MB 00:00 ETA (303/303): containernetwor 97% [===============-] 11 MB/s | 237 MB 00:00 ETA (303/303): containernetwor 97% [===============-] 10 MB/s | 237 MB 00:00 ETA (303/303): containernetwor 97% [===============-] 9.8 MB/s | 238 MB 00:00 ETA (303/303): containernetwor 97% [===============-] 9.3 MB/s | 238 MB 00:00 ETA (303/303): containernetwor 97% [===============-] 8.4 MB/s | 238 MB 00:00 ETA (303/303): containernetwor 97% [===============-] 7.9 MB/s | 239 MB 00:00 ETA (303/303): containernetwor 98% [===============-] 7.5 MB/s | 239 MB 00:00 ETA (303/303): containernetwor 98% [===============-] 7.1 MB/s | 240 MB 00:00 ETA (303/303): containernetwor 98% [===============-] 6.8 MB/s | 241 MB 00:00 ETA (303/303): containernetwor 99% [===============-] 6.6 MB/s | 242 MB 00:00 ETA (303/303): containernetwor 99% [===============-] 6.4 MB/s | 243 MB 00:00 ETA (303/303): containernetworking-plugins-0.7.4-3.git9ebe139. | 15 MB 00:18 + [[ -f /var/www/html/repos/yum/centos-appstream-el8/base/comps.xml ]] + repo_comps=("--groupfile=$repo_mp/comps.xml") + echo 'Generating yum repo metadata for: centos-appstream-el8' Generating yum repo metadata for: centos-appstream-el8 ++ repo_url centos-appstream-el8 yum base ++ local repo_name=centos-appstream-el8 ++ local repo_type=yum ++ local snapshot=base ++ echo http://mirrors.phx.ovirt.org/repos/yum/centos-appstream-el8/base + /bin/createrepo --update --workers=8 --baseurl=http://mirrors.phx.ovirt.org/repos/yum/centos-appstream-el8/base --retain-old-md=100 --groupfile=/var/www/html/repos/yum/centos-appstream-el8/base/comps.xml /var/www/html/repos/yum/centos-appstream-el8/base Spawning worker 0 with 35 pkgs Spawning worker 1 with 35 pkgs Spawning worker 2 with 35 pkgs Spawning worker 3 with 35 pkgs Spawning worker 4 with 34 pkgs Spawning worker 5 with 34 pkgs Spawning worker 6 with 34 pkgs Spawning worker 7 with 34 pkgs Workers Finished Saving Primary metadata Saving file lists metadata Saving other metadata Generating sqlite DBs Sqlite DBs complete ++ get_modulesmd_path centos-appstream-el8 ++ local repo_name=centos-appstream-el8 +++ sed -e 's/xmlns=".*"//g' /home/jenkins/mirrors_cache/centos-appstream-el8/repomd.xml +++ grep -o '[[:alnum:]_.-]*$' +++ xmllint --xpath 'string(/repomd/data[@type="modules"]/location/@href)' - ++ filename=29ca407bc5a6166ebf443c05da1dc642267b193fb5859f4b6a4c68550d1d40c0-modules.yaml.gz ++ [[ -z 29ca407bc5a6166ebf443c05da1dc642267b193fb5859f4b6a4c68550d1d40c0-modules.yaml.gz ]] ++ echo /home/jenkins/mirrors_cache/centos-appstream-el8/29ca407bc5a6166ebf443c05da1dc642267b193fb5859f4b6a4c68550d1d40c0-modules.yaml.gz + [[ -f /home/jenkins/mirrors_cache/centos-appstream-el8/29ca407bc5a6166ebf443c05da1dc642267b193fb5859f4b6a4c68550d1d40c0-modules.yaml.gz ]] + echo 'Module information found, updating metadata' Module information found, updating metadata + /bin/modifyrepo --mdtype=modules '' /var/www/html/repos/yum/centos-appstream-el8/base/repodata Could not add metadata from file : metadata cannot be None Build step 'Execute shell' marked build as failure

See <https://jenkins.ovirt.org/job/system-sync_mirrors-centos-appstream-el8-x86_64/11/display/redirect> Changes: ------------------------------------------ Started by user Evgheni Dereveanchin Running as SYSTEM [EnvInject] - Loading node environment variables. Building remotely on mirrors.phx.ovirt.org (mirrors) in workspace <https://jenkins.ovirt.org/job/system-sync_mirrors-centos-appstream-el8-x86_64/ws/> The recommended git tool is: NONE No credentials specified
git rev-parse --is-inside-work-tree # timeout=10 Fetching changes from the remote Git repository git config remote.origin.url http://gerrit.ovirt.org/jenkins.git # timeout=10 Cleaning workspace git rev-parse --verify HEAD # timeout=10 Resetting working tree git reset --hard # timeout=10 git clean -fdx # timeout=10 Pruning obsolete local branches Fetching upstream changes from http://gerrit.ovirt.org/jenkins.git git --version # timeout=10 git --version # 'git version 1.8.3.1' git fetch --tags --progress --prune http://gerrit.ovirt.org/jenkins.git refs/changes/34/111734/1:ederevea # timeout=10 ERROR: Error fetching remote repo 'origin' hudson.plugins.git.GitException: Failed to fetch from http://gerrit.ovirt.org/jenkins.git at hudson.plugins.git.GitSCM.fetchFrom(GitSCM.java:996) at hudson.plugins.git.GitSCM.retrieveChanges(GitSCM.java:1237) at hudson.plugins.git.GitSCM.checkout(GitSCM.java:1297) at hudson.scm.SCM.checkout(SCM.java:505) at hudson.model.AbstractProject.checkout(AbstractProject.java:1206) at hudson.model.AbstractBuild$AbstractBuildExecution.defaultCheckout(AbstractBuild.java:574) at jenkins.scm.SCMCheckoutStrategy.checkout(SCMCheckoutStrategy.java:86) at hudson.model.AbstractBuild$AbstractBuildExecution.run(AbstractBuild.java:499) at hudson.model.Run.execute(Run.java:1894) at hudson.model.FreeStyleBuild.run(FreeStyleBuild.java:43) at hudson.model.ResourceController.execute(ResourceController.java:97) at hudson.model.Executor.run(Executor.java:428) Caused by: hudson.plugins.git.GitException: Command "git fetch --tags --progress --prune http://gerrit.ovirt.org/jenkins.git refs/changes/34/111734/1:ederevea" returned status code 1: stdout: stderr: remote: Counting objects: 1 remote: Counting objects: 7, done remote: Finding sources: 25% (1/4) remote: Finding sources: 50% (2/4) remote: Finding sources: 75% (3/4) remote: Finding sources: 100% (4/4) remote: Finding sources: 100% (4/4) remote: Total 4 (delta 3), reused 4 (delta 3) From http://gerrit.ovirt.org/jenkins ! [rejected] refs/changes/34/111734/1 -> ederevea (non-fast-forward)
at org.jenkinsci.plugins.gitclient.CliGitAPIImpl.launchCommandIn(CliGitAPIImpl.java:2450) at org.jenkinsci.plugins.gitclient.CliGitAPIImpl.launchCommandWithCredentials(CliGitAPIImpl.java:2051) at org.jenkinsci.plugins.gitclient.CliGitAPIImpl.access$500(CliGitAPIImpl.java:84) at org.jenkinsci.plugins.gitclient.CliGitAPIImpl$1.execute(CliGitAPIImpl.java:573) at org.jenkinsci.plugins.gitclient.RemoteGitImpl$CommandInvocationHandler$GitCommandMasterToSlaveCallable.call(RemoteGitImpl.java:161) at org.jenkinsci.plugins.gitclient.RemoteGitImpl$CommandInvocationHandler$GitCommandMasterToSlaveCallable.call(RemoteGitImpl.java:154) at hudson.remoting.UserRequest.perform(UserRequest.java:211) at hudson.remoting.UserRequest.perform(UserRequest.java:54) at hudson.remoting.Request$2.run(Request.java:375) at hudson.remoting.InterceptingExecutorService$1.call(InterceptingExecutorService.java:73) at java.util.concurrent.FutureTask.run(FutureTask.java:266) at java.util.concurrent.ThreadPoolExecutor.runWorker(ThreadPoolExecutor.java:1149) at java.util.concurrent.ThreadPoolExecutor$Worker.run(ThreadPoolExecutor.java:624) at java.lang.Thread.run(Thread.java:748) Suppressed: hudson.remoting.Channel$CallSiteStackTrace: Remote call to mirrors.phx.ovirt.org at hudson.remoting.Channel.attachCallSiteStackTrace(Channel.java:1800) at hudson.remoting.UserRequest$ExceptionResponse.retrieve(UserRequest.java:357) at hudson.remoting.Channel.call(Channel.java:1001) at org.jenkinsci.plugins.gitclient.RemoteGitImpl$CommandInvocationHandler.execute(RemoteGitImpl.java:146) at sun.reflect.GeneratedMethodAccessor644.invoke(Unknown Source) at sun.reflect.DelegatingMethodAccessorImpl.invoke(DelegatingMethodAccessorImpl.java:43) at java.lang.reflect.Method.invoke(Method.java:498) at org.jenkinsci.plugins.gitclient.RemoteGitImpl$CommandInvocationHandler.invoke(RemoteGitImpl.java:132) at com.sun.proxy.$Proxy105.execute(Unknown Source) at hudson.plugins.git.GitSCM.fetchFrom(GitSCM.java:994) at hudson.plugins.git.GitSCM.retrieveChanges(GitSCM.java:1237) at hudson.plugins.git.GitSCM.checkout(GitSCM.java:1297) at hudson.scm.SCM.checkout(SCM.java:505) at hudson.model.AbstractProject.checkout(AbstractProject.java:1206) at hudson.model.AbstractBuild$AbstractBuildExecution.defaultCheckout(AbstractBuild.java:574) at jenkins.scm.SCMCheckoutStrategy.checkout(SCMCheckoutStrategy.java:86) at hudson.model.AbstractBuild$AbstractBuildExecution.run(AbstractBuild.java:499) at hudson.model.Run.execute(Run.java:1894) at hudson.model.FreeStyleBuild.run(FreeStyleBuild.java:43) at hudson.model.ResourceController.execute(ResourceController.java:97) at hudson.model.Executor.run(Executor.java:428) ERROR: Error fetching remote repo 'origin'

See <https://jenkins.ovirt.org/job/system-sync_mirrors-centos-appstream-el8-x86_64/12/display/redirect> Changes: ------------------------------------------ Started by user Evgheni Dereveanchin Running as SYSTEM [EnvInject] - Loading node environment variables. Building remotely on mirrors.phx.ovirt.org (mirrors) in workspace <https://jenkins.ovirt.org/job/system-sync_mirrors-centos-appstream-el8-x86_64/ws/> The recommended git tool is: NONE No credentials specified
git rev-parse --is-inside-work-tree # timeout=10 Fetching changes from the remote Git repository git config remote.origin.url http://gerrit.ovirt.org/jenkins.git # timeout=10 Cleaning workspace git rev-parse --verify HEAD # timeout=10 Resetting working tree git reset --hard # timeout=10 git clean -fdx # timeout=10 Pruning obsolete local branches Fetching upstream changes from http://gerrit.ovirt.org/jenkins.git git --version # timeout=10 git --version # 'git version 1.8.3.1' git fetch --tags --progress --prune http://gerrit.ovirt.org/jenkins.git refs/changes/34/111734/1:ederevea # timeout=10 ERROR: Error fetching remote repo 'origin' hudson.plugins.git.GitException: Failed to fetch from http://gerrit.ovirt.org/jenkins.git at hudson.plugins.git.GitSCM.fetchFrom(GitSCM.java:996) at hudson.plugins.git.GitSCM.retrieveChanges(GitSCM.java:1237) at hudson.plugins.git.GitSCM.checkout(GitSCM.java:1297) at hudson.scm.SCM.checkout(SCM.java:505) at hudson.model.AbstractProject.checkout(AbstractProject.java:1206) at hudson.model.AbstractBuild$AbstractBuildExecution.defaultCheckout(AbstractBuild.java:574) at jenkins.scm.SCMCheckoutStrategy.checkout(SCMCheckoutStrategy.java:86) at hudson.model.AbstractBuild$AbstractBuildExecution.run(AbstractBuild.java:499) at hudson.model.Run.execute(Run.java:1894) at hudson.model.FreeStyleBuild.run(FreeStyleBuild.java:43) at hudson.model.ResourceController.execute(ResourceController.java:97) at hudson.model.Executor.run(Executor.java:428) Caused by: hudson.plugins.git.GitException: Command "git fetch --tags --progress --prune http://gerrit.ovirt.org/jenkins.git refs/changes/34/111734/1:ederevea" returned status code 1: stdout: stderr: From http://gerrit.ovirt.org/jenkins ! [rejected] refs/changes/34/111734/1 -> ederevea (non-fast-forward)
at org.jenkinsci.plugins.gitclient.CliGitAPIImpl.launchCommandIn(CliGitAPIImpl.java:2450) at org.jenkinsci.plugins.gitclient.CliGitAPIImpl.launchCommandWithCredentials(CliGitAPIImpl.java:2051) at org.jenkinsci.plugins.gitclient.CliGitAPIImpl.access$500(CliGitAPIImpl.java:84) at org.jenkinsci.plugins.gitclient.CliGitAPIImpl$1.execute(CliGitAPIImpl.java:573) at org.jenkinsci.plugins.gitclient.RemoteGitImpl$CommandInvocationHandler$GitCommandMasterToSlaveCallable.call(RemoteGitImpl.java:161) at org.jenkinsci.plugins.gitclient.RemoteGitImpl$CommandInvocationHandler$GitCommandMasterToSlaveCallable.call(RemoteGitImpl.java:154) at hudson.remoting.UserRequest.perform(UserRequest.java:211) at hudson.remoting.UserRequest.perform(UserRequest.java:54) at hudson.remoting.Request$2.run(Request.java:375) at hudson.remoting.InterceptingExecutorService$1.call(InterceptingExecutorService.java:73) at java.util.concurrent.FutureTask.run(FutureTask.java:266) at java.util.concurrent.ThreadPoolExecutor.runWorker(ThreadPoolExecutor.java:1149) at java.util.concurrent.ThreadPoolExecutor$Worker.run(ThreadPoolExecutor.java:624) at java.lang.Thread.run(Thread.java:748) Suppressed: hudson.remoting.Channel$CallSiteStackTrace: Remote call to mirrors.phx.ovirt.org at hudson.remoting.Channel.attachCallSiteStackTrace(Channel.java:1800) at hudson.remoting.UserRequest$ExceptionResponse.retrieve(UserRequest.java:357) at hudson.remoting.Channel.call(Channel.java:1001) at org.jenkinsci.plugins.gitclient.RemoteGitImpl$CommandInvocationHandler.execute(RemoteGitImpl.java:146) at sun.reflect.GeneratedMethodAccessor644.invoke(Unknown Source) at sun.reflect.DelegatingMethodAccessorImpl.invoke(DelegatingMethodAccessorImpl.java:43) at java.lang.reflect.Method.invoke(Method.java:498) at org.jenkinsci.plugins.gitclient.RemoteGitImpl$CommandInvocationHandler.invoke(RemoteGitImpl.java:132) at com.sun.proxy.$Proxy105.execute(Unknown Source) at hudson.plugins.git.GitSCM.fetchFrom(GitSCM.java:994) at hudson.plugins.git.GitSCM.retrieveChanges(GitSCM.java:1237) at hudson.plugins.git.GitSCM.checkout(GitSCM.java:1297) at hudson.scm.SCM.checkout(SCM.java:505) at hudson.model.AbstractProject.checkout(AbstractProject.java:1206) at hudson.model.AbstractBuild$AbstractBuildExecution.defaultCheckout(AbstractBuild.java:574) at jenkins.scm.SCMCheckoutStrategy.checkout(SCMCheckoutStrategy.java:86) at hudson.model.AbstractBuild$AbstractBuildExecution.run(AbstractBuild.java:499) at hudson.model.Run.execute(Run.java:1894) at hudson.model.FreeStyleBuild.run(FreeStyleBuild.java:43) at hudson.model.ResourceController.execute(ResourceController.java:97) at hudson.model.Executor.run(Executor.java:428) ERROR: Error fetching remote repo 'origin'
participants (1)
-
jenkins@jenkins.phx.ovirt.org