[oVirt Jenkins] ovirt-system-tests_hc-basic-suite-4.2 - Build # 602 - Failure!

Project: http://jenkins.ovirt.org/job/ovirt-system-tests_hc-basic-suite-4.2/ Build: http://jenkins.ovirt.org/job/ovirt-system-tests_hc-basic-suite-4.2/602/ Build Number: 602 Build Status: Failure Triggered By: Started by timer ------------------------------------- Changes Since Last Success: ------------------------------------- Changes for Build #602 [Ondra Machacek] ansible-suite: Rename modules plural to singular ----------------- Failed Tests: ----------------- 1 tests failed. FAILED: 002_bootstrap.add_hosts Error Message: The response content type 'text/html; charset=iso-8859-1' isn't the expected XML -------------------- >> begin captured logging << -------------------- ovirtlago.testlib: ERROR: * Unhandled exception in <function _host_is_up_4 at 0x7fd761a96578> Traceback (most recent call last): File "/usr/lib/python2.7/site-packages/ovirtlago/testlib.py", line 234, in assert_equals_within res = func() File "/home/jenkins/workspace/ovirt-system-tests_hc-basic-suite-4.2/ovirt-system-tests/hc-basic-suite-4.2/test-scenarios/002_bootstrap.py", line 254, in _host_is_up_4 host_obj = host_service.get() File "/usr/lib64/python2.7/site-packages/ovirtsdk4/services.py", line 37093, in get return self._internal_get(headers, query, wait) File "/usr/lib64/python2.7/site-packages/ovirtsdk4/service.py", line 211, in _internal_get return future.wait() if wait else future File "/usr/lib64/python2.7/site-packages/ovirtsdk4/service.py", line 55, in wait return self._code(response) File "/usr/lib64/python2.7/site-packages/ovirtsdk4/service.py", line 208, in callback self._check_fault(response) File "/usr/lib64/python2.7/site-packages/ovirtsdk4/service.py", line 130, in _check_fault body = self._internal_read_body(response) File "/usr/lib64/python2.7/site-packages/ovirtsdk4/service.py", line 316, in _internal_read_body self._connection.check_xml_content_type(response) File "/usr/lib64/python2.7/site-packages/ovirtsdk4/__init__.py", line 849, in check_xml_content_type response.headers File "/usr/lib64/python2.7/site-packages/ovirtsdk4/__init__.py", line 889, in _check_content_type raise Error(msg) Error: The response content type 'text/html; charset=iso-8859-1' isn't the expected XML --------------------- >> end captured logging << --------------------- Stack Trace: File "/usr/lib64/python2.7/unittest/case.py", line 369, in run testMethod() File "/usr/lib/python2.7/site-packages/nose/case.py", line 197, in runTest self.test(*self.arg) File "/usr/lib/python2.7/site-packages/ovirtlago/testlib.py", line 142, in wrapped_test test() File "/usr/lib/python2.7/site-packages/ovirtlago/testlib.py", line 60, in wrapper return func(get_test_prefix(), *args, **kwargs) File "/home/jenkins/workspace/ovirt-system-tests_hc-basic-suite-4.2/ovirt-system-tests/hc-basic-suite-4.2/test-scenarios/002_bootstrap.py", line 229, in add_hosts add_hosts_4(prefix) File "/home/jenkins/workspace/ovirt-system-tests_hc-basic-suite-4.2/ovirt-system-tests/hc-basic-suite-4.2/test-scenarios/002_bootstrap.py", line 273, in add_hosts_4 testlib.assert_true_within(_host_is_up_4, timeout=15*60) File "/usr/lib/python2.7/site-packages/ovirtlago/testlib.py", line 278, in assert_true_within assert_equals_within(func, True, timeout, allowed_exceptions) File "/usr/lib/python2.7/site-packages/ovirtlago/testlib.py", line 234, in assert_equals_within res = func() File "/home/jenkins/workspace/ovirt-system-tests_hc-basic-suite-4.2/ovirt-system-tests/hc-basic-suite-4.2/test-scenarios/002_bootstrap.py", line 254, in _host_is_up_4 host_obj = host_service.get() File "/usr/lib64/python2.7/site-packages/ovirtsdk4/services.py", line 37093, in get return self._internal_get(headers, query, wait) File "/usr/lib64/python2.7/site-packages/ovirtsdk4/service.py", line 211, in _internal_get return future.wait() if wait else future File "/usr/lib64/python2.7/site-packages/ovirtsdk4/service.py", line 55, in wait return self._code(response) File "/usr/lib64/python2.7/site-packages/ovirtsdk4/service.py", line 208, in callback self._check_fault(response) File "/usr/lib64/python2.7/site-packages/ovirtsdk4/service.py", line 130, in _check_fault body = self._internal_read_body(response) File "/usr/lib64/python2.7/site-packages/ovirtsdk4/service.py", line 316, in _internal_read_body self._connection.check_xml_content_type(response) File "/usr/lib64/python2.7/site-packages/ovirtsdk4/__init__.py", line 849, in check_xml_content_type response.headers File "/usr/lib64/python2.7/site-packages/ovirtsdk4/__init__.py", line 889, in _check_content_type raise Error(msg) 'The response content type \'text/html; charset=iso-8859-1\' isn\'t the expected XML\n-------------------- >> begin captured logging << --------------------\novirtlago.testlib: ERROR: * Unhandled exception in <function _host_is_up_4 at 0x7fd761a96578>\nTraceback (most recent call last):\n File "/usr/lib/python2.7/site-packages/ovirtlago/testlib.py", line 234, in assert_equals_within\n res = func()\n File "/home/jenkins/workspace/ovirt-system-tests_hc-basic-suite-4.2/ovirt-system-tests/hc-basic-suite-4.2/test-scenarios/002_bootstrap.py", line 254, in _host_is_up_4\n host_obj = host_service.get()\n File "/usr/lib64/python2.7/site-packages/ovirtsdk4/services.py", line 37093, in get\n return self._internal_get(headers, query, wait)\n File "/usr/lib64/python2.7/site-packages/ovirtsdk4/service.py", line 211, in _internal_get\n return future.wait() if wait else future\n File "/usr/lib64/python2.7/site-packages/ovirtsdk4/service.py", line 55, in wait\n return self._code(response)\n File "/usr/lib64/python2.7/site-packages/ovirtsdk4/service.py", line 208, in callback\n self._check_fault(response)\n File "/usr/lib64/python2.7/site-packages/ovirtsdk4/service.py", line 130, in _check_fault\n body = self._internal_read_body(response)\n File "/usr/lib64/python2.7/site-packages/ovirtsdk4/service.py", line 316, in _internal_read_body\n self._connection.check_xml_content_type(response)\n File "/usr/lib64/python2.7/site-packages/ovirtsdk4/__init__.py", line 849, in check_xml_content_type\n response.headers\n File "/usr/lib64/python2.7/site-packages/ovirtsdk4/__init__.py", line 889, in _check_content_type\n raise Error(msg)\nError: The response content type \'text/html; charset=iso-8859-1\' isn\'t the expected XML\n--------------------- >> end captured logging << ---------------------'

Project: http://jenkins.ovirt.org/job/ovirt-system-tests_hc-basic-suite-4.2/ Build: http://jenkins.ovirt.org/job/ovirt-system-tests_hc-basic-suite-4.2/603/ Build Number: 603 Build Status: Still Failing Triggered By: Started by timer ------------------------------------- Changes Since Last Success: ------------------------------------- Changes for Build #602 [Ondra Machacek] ansible-suite: Rename modules plural to singular Changes for Build #603 [Ondra Machacek] ansible-suite: Rename modules plural to singular ----------------- Failed Tests: ----------------- 2 tests failed. FAILED: 002_bootstrap.add_hosts Error Message: The response content type 'text/html; charset=iso-8859-1' isn't the expected XML -------------------- >> begin captured logging << -------------------- ovirtlago.testlib: ERROR: * Unhandled exception in <function _host_is_up_4 at 0x7ff74105b578> Traceback (most recent call last): File "/usr/lib/python2.7/site-packages/ovirtlago/testlib.py", line 234, in assert_equals_within res = func() File "/home/jenkins/workspace/ovirt-system-tests_hc-basic-suite-4.2/ovirt-system-tests/hc-basic-suite-4.2/test-scenarios/002_bootstrap.py", line 254, in _host_is_up_4 host_obj = host_service.get() File "/usr/lib64/python2.7/site-packages/ovirtsdk4/services.py", line 37093, in get return self._internal_get(headers, query, wait) File "/usr/lib64/python2.7/site-packages/ovirtsdk4/service.py", line 211, in _internal_get return future.wait() if wait else future File "/usr/lib64/python2.7/site-packages/ovirtsdk4/service.py", line 55, in wait return self._code(response) File "/usr/lib64/python2.7/site-packages/ovirtsdk4/service.py", line 208, in callback self._check_fault(response) File "/usr/lib64/python2.7/site-packages/ovirtsdk4/service.py", line 130, in _check_fault body = self._internal_read_body(response) File "/usr/lib64/python2.7/site-packages/ovirtsdk4/service.py", line 316, in _internal_read_body self._connection.check_xml_content_type(response) File "/usr/lib64/python2.7/site-packages/ovirtsdk4/__init__.py", line 849, in check_xml_content_type response.headers File "/usr/lib64/python2.7/site-packages/ovirtsdk4/__init__.py", line 889, in _check_content_type raise Error(msg) Error: The response content type 'text/html; charset=iso-8859-1' isn't the expected XML --------------------- >> end captured logging << --------------------- Stack Trace: File "/usr/lib64/python2.7/unittest/case.py", line 369, in run testMethod() File "/usr/lib/python2.7/site-packages/nose/case.py", line 197, in runTest self.test(*self.arg) File "/usr/lib/python2.7/site-packages/ovirtlago/testlib.py", line 142, in wrapped_test test() File "/usr/lib/python2.7/site-packages/ovirtlago/testlib.py", line 60, in wrapper return func(get_test_prefix(), *args, **kwargs) File "/home/jenkins/workspace/ovirt-system-tests_hc-basic-suite-4.2/ovirt-system-tests/hc-basic-suite-4.2/test-scenarios/002_bootstrap.py", line 229, in add_hosts add_hosts_4(prefix) File "/home/jenkins/workspace/ovirt-system-tests_hc-basic-suite-4.2/ovirt-system-tests/hc-basic-suite-4.2/test-scenarios/002_bootstrap.py", line 273, in add_hosts_4 testlib.assert_true_within(_host_is_up_4, timeout=15*60) File "/usr/lib/python2.7/site-packages/ovirtlago/testlib.py", line 278, in assert_true_within assert_equals_within(func, True, timeout, allowed_exceptions) File "/usr/lib/python2.7/site-packages/ovirtlago/testlib.py", line 234, in assert_equals_within res = func() File "/home/jenkins/workspace/ovirt-system-tests_hc-basic-suite-4.2/ovirt-system-tests/hc-basic-suite-4.2/test-scenarios/002_bootstrap.py", line 254, in _host_is_up_4 host_obj = host_service.get() File "/usr/lib64/python2.7/site-packages/ovirtsdk4/services.py", line 37093, in get return self._internal_get(headers, query, wait) File "/usr/lib64/python2.7/site-packages/ovirtsdk4/service.py", line 211, in _internal_get return future.wait() if wait else future File "/usr/lib64/python2.7/site-packages/ovirtsdk4/service.py", line 55, in wait return self._code(response) File "/usr/lib64/python2.7/site-packages/ovirtsdk4/service.py", line 208, in callback self._check_fault(response) File "/usr/lib64/python2.7/site-packages/ovirtsdk4/service.py", line 130, in _check_fault body = self._internal_read_body(response) File "/usr/lib64/python2.7/site-packages/ovirtsdk4/service.py", line 316, in _internal_read_body self._connection.check_xml_content_type(response) File "/usr/lib64/python2.7/site-packages/ovirtsdk4/__init__.py", line 849, in check_xml_content_type response.headers File "/usr/lib64/python2.7/site-packages/ovirtsdk4/__init__.py", line 889, in _check_content_type raise Error(msg) 'The response content type \'text/html; charset=iso-8859-1\' isn\'t the expected XML\n-------------------- >> begin captured logging << --------------------\novirtlago.testlib: ERROR: * Unhandled exception in <function _host_is_up_4 at 0x7ff74105b578>\nTraceback (most recent call last):\n File "/usr/lib/python2.7/site-packages/ovirtlago/testlib.py", line 234, in assert_equals_within\n res = func()\n File "/home/jenkins/workspace/ovirt-system-tests_hc-basic-suite-4.2/ovirt-system-tests/hc-basic-suite-4.2/test-scenarios/002_bootstrap.py", line 254, in _host_is_up_4\n host_obj = host_service.get()\n File "/usr/lib64/python2.7/site-packages/ovirtsdk4/services.py", line 37093, in get\n return self._internal_get(headers, query, wait)\n File "/usr/lib64/python2.7/site-packages/ovirtsdk4/service.py", line 211, in _internal_get\n return future.wait() if wait else future\n File "/usr/lib64/python2.7/site-packages/ovirtsdk4/service.py", line 55, in wait\n return self._code(response)\n File "/usr/lib64/python2.7/site-packages/ovirtsdk4/service.py", line 208, in callback\n self._check_fault(response)\n File "/usr/lib64/python2.7/site-packages/ovirtsdk4/service.py", line 130, in _check_fault\n body = self._internal_read_body(response)\n File "/usr/lib64/python2.7/site-packages/ovirtsdk4/service.py", line 316, in _internal_read_body\n self._connection.check_xml_content_type(response)\n File "/usr/lib64/python2.7/site-packages/ovirtsdk4/__init__.py", line 849, in check_xml_content_type\n response.headers\n File "/usr/lib64/python2.7/site-packages/ovirtsdk4/__init__.py", line 889, in _check_content_type\n raise Error(msg)\nError: The response content type \'text/html; charset=iso-8859-1\' isn\'t the expected XML\n--------------------- >> end captured logging << ---------------------' FAILED: 002_bootstrap.add_hosts Error Message: scp: /var/log/ovirt-engine/boot.log: Broken pipe -------------------- >> begin captured logging << -------------------- ovirtlago.testlib: ERROR: * Unhandled exception in <function _host_is_up_4 at 0x7ff74105b578> Traceback (most recent call last): File "/usr/lib/python2.7/site-packages/ovirtlago/testlib.py", line 234, in assert_equals_within res = func() File "/home/jenkins/workspace/ovirt-system-tests_hc-basic-suite-4.2/ovirt-system-tests/hc-basic-suite-4.2/test-scenarios/002_bootstrap.py", line 254, in _host_is_up_4 host_obj = host_service.get() File "/usr/lib64/python2.7/site-packages/ovirtsdk4/services.py", line 37093, in get return self._internal_get(headers, query, wait) File "/usr/lib64/python2.7/site-packages/ovirtsdk4/service.py", line 211, in _internal_get return future.wait() if wait else future File "/usr/lib64/python2.7/site-packages/ovirtsdk4/service.py", line 55, in wait return self._code(response) File "/usr/lib64/python2.7/site-packages/ovirtsdk4/service.py", line 208, in callback self._check_fault(response) File "/usr/lib64/python2.7/site-packages/ovirtsdk4/service.py", line 130, in _check_fault body = self._internal_read_body(response) File "/usr/lib64/python2.7/site-packages/ovirtsdk4/service.py", line 316, in _internal_read_body self._connection.check_xml_content_type(response) File "/usr/lib64/python2.7/site-packages/ovirtsdk4/__init__.py", line 849, in check_xml_content_type response.headers File "/usr/lib64/python2.7/site-packages/ovirtsdk4/__init__.py", line 889, in _check_content_type raise Error(msg) Error: The response content type 'text/html; charset=iso-8859-1' isn't the expected XML lago.prefix: INFO: * Collect artifacts: ?[0m?[0m lago.prefix: INFO: ?[0m?[0m lago.prefix: INFO: ?[0m?[0m lago.prefix: INFO: ?[0m?[0m lago.plugins.vm: DEBUG: Extracting scp://lago-hc-basic-suite-4-2-host1:/var/log to /dev/shm/ost/deployment-hc-basic-suite-4.2/default/test_logs/002_bootstrap.add_hosts-20181027173541/lago-hc-basic-suite-4-2-host1/_var_log lago.prefix: INFO: ?[0m?[0m lago.plugins.vm: DEBUG: Extracting scp://lago-hc-basic-suite-4-2-host2:/var/log to /dev/shm/ost/deployment-hc-basic-suite-4.2/default/test_logs/002_bootstrap.add_hosts-20181027173541/lago-hc-basic-suite-4-2-host2/_var_log lago.ssh: DEBUG: start task:472384e9-de80-4adb-a02c-c246550ba54e:Get ssh client for lago-hc-basic-suite-4-2-host1: lago.plugins.vm: DEBUG: Extracting scp://lago-hc-basic-suite-4-2-host0:/var/log to /dev/shm/ost/deployment-hc-basic-suite-4.2/default/test_logs/002_bootstrap.add_hosts-20181027173541/lago-hc-basic-suite-4-2-host0/_var_log lago.ssh: DEBUG: start task:4d05d0a2-fd94-42ab-a732-b77ee0d4696c:Get ssh client for lago-hc-basic-suite-4-2-host2: lago.ssh: DEBUG: start task:d54107ff-847b-4113-be18-5283c742fc14:Get ssh client for lago-hc-basic-suite-4-2-engine: lago.ssh: DEBUG: start task:1559fbf0-f27e-4fb7-9a34-8378e89acebd:Get ssh client for lago-hc-basic-suite-4-2-host0: lago.ssh: DEBUG: end task:472384e9-de80-4adb-a02c-c246550ba54e:Get ssh client for lago-hc-basic-suite-4-2-host1: lago.ssh: DEBUG: end task:4d05d0a2-fd94-42ab-a732-b77ee0d4696c:Get ssh client for lago-hc-basic-suite-4-2-host2: lago.ssh: DEBUG: end task:1559fbf0-f27e-4fb7-9a34-8378e89acebd:Get ssh client for lago-hc-basic-suite-4-2-host0: lago.prefix: INFO: ?[32mSuccess?[0m (in 0:00:01) lago.ssh: DEBUG: end task:d54107ff-847b-4113-be18-5283c742fc14:Get ssh client for lago-hc-basic-suite-4-2-engine: lago.plugins.vm: DEBUG: Extracting scp://lago-hc-basic-suite-4-2-engine:/var/log to /dev/shm/ost/deployment-hc-basic-suite-4.2/default/test_logs/002_bootstrap.add_hosts-20181027173541/lago-hc-basic-suite-4-2-engine/_var_log lago.ssh: DEBUG: start task:f91de10b-bc3a-4892-8cc8-df6df0daf34a:Get ssh client for lago-hc-basic-suite-4-2-engine: lago.prefix: INFO: ?[32mSuccess?[0m (in 0:00:01) lago.ssh: DEBUG: end task:f91de10b-bc3a-4892-8cc8-df6df0daf34a:Get ssh client for lago-hc-basic-suite-4-2-engine: lago.prefix: INFO: ?[32mSuccess?[0m (in 0:00:03) root: ERROR: - [Thread-13] lago-hc-basic-suite-4-2-engine: ?[31mERROR?[0m (in 0:00:05) lago.prefix: DEBUG: File "/usr/lib/python2.7/site-packages/lago/prefix.py", line 1524, in _collect_artifacts vm.collect_artifacts(path, ignore_nopath) File "/usr/lib/python2.7/site-packages/lago/plugins/vm.py", line 644, in collect_artifacts ignore_nopath=ignore_nopath File "/usr/lib/python2.7/site-packages/lago/plugins/vm.py", line 384, in extract_paths return self.provider.extract_paths(paths, *args, **kwargs) File "/usr/lib/python2.7/site-packages/lago/plugins/vm.py", line 249, in extract_paths self._extract_paths_scp(paths=paths, ignore_nopath=ignore_nopath) File "/usr/lib/python2.7/site-packages/lago/plugins/vm.py", line 83, in wrapper return func(self, *args, **kwargs) File "/usr/lib/python2.7/site-packages/lago/plugins/vm.py", line 269, in _extract_paths_scp propagate_fail=False File "/usr/lib/python2.7/site-packages/lago/plugins/vm.py", line 428, in copy_from local_path=local_path, File "/usr/lib/python2.7/site-packages/scp.py", line 125, in get self._recv_all() File "/usr/lib/python2.7/site-packages/scp.py", line 255, in _recv_all command[code](msg[1:]) File "/usr/lib/python2.7/site-packages/scp.py", line 315, in _recv_file raise SCPException(msg[1:]) lago.utils: ERROR: Error while running thread Traceback (most recent call last): File "/usr/lib/python2.7/site-packages/lago/utils.py", line 58, in _ret_via_queue queue.put({'return': func()}) File "/usr/lib/python2.7/site-packages/lago/prefix.py", line 1524, in _collect_artifacts vm.collect_artifacts(path, ignore_nopath) File "/usr/lib/python2.7/site-packages/lago/plugins/vm.py", line 644, in collect_artifacts ignore_nopath=ignore_nopath File "/usr/lib/python2.7/site-packages/lago/plugins/vm.py", line 384, in extract_paths return self.provider.extract_paths(paths, *args, **kwargs) File "/usr/lib/python2.7/site-packages/lago/plugins/vm.py", line 249, in extract_paths self._extract_paths_scp(paths=paths, ignore_nopath=ignore_nopath) File "/usr/lib/python2.7/site-packages/lago/plugins/vm.py", line 83, in wrapper return func(self, *args, **kwargs) File "/usr/lib/python2.7/site-packages/lago/plugins/vm.py", line 269, in _extract_paths_scp propagate_fail=False File "/usr/lib/python2.7/site-packages/lago/plugins/vm.py", line 428, in copy_from local_path=local_path, File "/usr/lib/python2.7/site-packages/scp.py", line 125, in get self._recv_all() File "/usr/lib/python2.7/site-packages/scp.py", line 255, in _recv_all command[code](msg[1:]) File "/usr/lib/python2.7/site-packages/scp.py", line 315, in _recv_file raise SCPException(msg[1:]) SCPException: scp: /var/log/ovirt-engine/boot.log: Broken pipe root: ERROR: * Collect artifacts: ?[31mERROR?[0m (in 0:00:05) lago.prefix: DEBUG: File "/usr/lib/python2.7/site-packages/lago/log_utils.py", line 636, in wrapper return func(*args, **kwargs) File "/usr/lib/python2.7/site-packages/lago/prefix.py", line 1528, in collect_artifacts self.virt_env.get_vms().values(), File "/usr/lib/python2.7/site-packages/lago/utils.py", line 100, in invoke_in_parallel return vt.join_all() File "/usr/lib/python2.7/site-packages/lago/utils.py", line 58, in _ret_via_queue queue.put({'return': func()}) File "/usr/lib/python2.7/site-packages/lago/prefix.py", line 1524, in _collect_artifacts vm.collect_artifacts(path, ignore_nopath) File "/usr/lib/python2.7/site-packages/lago/plugins/vm.py", line 644, in collect_artifacts ignore_nopath=ignore_nopath File "/usr/lib/python2.7/site-packages/lago/plugins/vm.py", line 384, in extract_paths return self.provider.extract_paths(paths, *args, **kwargs) File "/usr/lib/python2.7/site-packages/lago/plugins/vm.py", line 249, in extract_paths self._extract_paths_scp(paths=paths, ignore_nopath=ignore_nopath) File "/usr/lib/python2.7/site-packages/lago/plugins/vm.py", line 83, in wrapper return func(self, *args, **kwargs) File "/usr/lib/python2.7/site-packages/lago/plugins/vm.py", line 269, in _extract_paths_scp propagate_fail=False File "/usr/lib/python2.7/site-packages/lago/plugins/vm.py", line 428, in copy_from local_path=local_path, File "/usr/lib/python2.7/site-packages/scp.py", line 125, in get self._recv_all() File "/usr/lib/python2.7/site-packages/scp.py", line 255, in _recv_all command[code](msg[1:]) File "/usr/lib/python2.7/site-packages/scp.py", line 315, in _recv_file raise SCPException(msg[1:]) --------------------- >> end captured logging << --------------------- Stack Trace: File "/usr/lib/python2.7/site-packages/nose/case.py", line 133, in run self.runTest(result) File "/usr/lib/python2.7/site-packages/nose/case.py", line 151, in runTest test(result) File "/usr/lib64/python2.7/unittest/case.py", line 433, in __call__ return self.run(*args, **kwds) File "/usr/lib64/python2.7/unittest/case.py", line 393, in run result.addError(self, sys.exc_info()) File "/usr/lib/python2.7/site-packages/nose/proxy.py", line 131, in addError plugins.addError(self.test, err) File "/usr/lib/python2.7/site-packages/nose/plugins/manager.py", line 99, in __call__ return self.call(*arg, **kw) File "/usr/lib/python2.7/site-packages/nose/plugins/manager.py", line 167, in simple result = meth(*arg, **kw) File "/usr/lib/python2.7/site-packages/ovirtlago/testlib.py", line 163, in addError self._addFault(test, err) File "/usr/lib/python2.7/site-packages/ovirtlago/testlib.py", line 174, in _addFault self._prefix.paths.test_logs(test_name), False File "/usr/lib/python2.7/site-packages/lago/sdk_utils.py", line 50, in wrapped return func(*args, **kwargs) File "/usr/lib/python2.7/site-packages/lago/log_utils.py", line 636, in wrapper return func(*args, **kwargs) File "/usr/lib/python2.7/site-packages/lago/prefix.py", line 1528, in collect_artifacts self.virt_env.get_vms().values(), File "/usr/lib/python2.7/site-packages/lago/utils.py", line 100, in invoke_in_parallel return vt.join_all() File "/usr/lib/python2.7/site-packages/lago/utils.py", line 58, in _ret_via_queue queue.put({'return': func()}) File "/usr/lib/python2.7/site-packages/lago/prefix.py", line 1524, in _collect_artifacts vm.collect_artifacts(path, ignore_nopath) File "/usr/lib/python2.7/site-packages/lago/plugins/vm.py", line 644, in collect_artifacts ignore_nopath=ignore_nopath File "/usr/lib/python2.7/site-packages/lago/plugins/vm.py", line 384, in extract_paths return self.provider.extract_paths(paths, *args, **kwargs) File "/usr/lib/python2.7/site-packages/lago/plugins/vm.py", line 249, in extract_paths self._extract_paths_scp(paths=paths, ignore_nopath=ignore_nopath) File "/usr/lib/python2.7/site-packages/lago/plugins/vm.py", line 83, in wrapper return func(self, *args, **kwargs) File "/usr/lib/python2.7/site-packages/lago/plugins/vm.py", line 269, in _extract_paths_scp propagate_fail=False File "/usr/lib/python2.7/site-packages/lago/plugins/vm.py", line 428, in copy_from local_path=local_path, File "/usr/lib/python2.7/site-packages/scp.py", line 125, in get self._recv_all() File "/usr/lib/python2.7/site-packages/scp.py", line 255, in _recv_all command[code](msg[1:]) File "/usr/lib/python2.7/site-packages/scp.py", line 315, in _recv_file raise SCPException(msg[1:]) 'scp: /var/log/ovirt-engine/boot.log: Broken pipe\n\n-------------------- >> begin captured logging << --------------------\novirtlago.testlib: ERROR: * Unhandled exception in <function _host_is_up_4 at 0x7ff74105b578>\nTraceback (most recent call last):\n File "/usr/lib/python2.7/site-packages/ovirtlago/testlib.py", line 234, in assert_equals_within\n res = func()\n File "/home/jenkins/workspace/ovirt-system-tests_hc-basic-suite-4.2/ovirt-system-tests/hc-basic-suite-4.2/test-scenarios/002_bootstrap.py", line 254, in _host_is_up_4\n host_obj = host_service.get()\n File "/usr/lib64/python2.7/site-packages/ovirtsdk4/services.py", line 37093, in get\n return self._internal_get(headers, query, wait)\n File "/usr/lib64/python2.7/site-packages/ovirtsdk4/service.py", line 211, in _internal_get\n return future.wait() if wait else future\n File "/usr/lib64/python2.7/site-packages/ovirtsdk4/service.py", line 55, in wait\n return self._code(response)\n File "/usr/lib64/python2.7/site-packages/ovirtsdk4/service.py", line 208, in callback\n self._check_fault(response)\n File "/usr/lib64/python2.7/site-packages/ovirtsdk4/service.py", line 130, in _check_fault\n body = self._internal_read_body(response)\n File "/usr/lib64/python2.7/site-packages/ovirtsdk4/service.py", line 316, in _internal_read_body\n self._connection.check_xml_content_type(response)\n File "/usr/lib64/python2.7/site-packages/ovirtsdk4/__init__.py", line 849, in check_xml_content_type\n response.headers\n File "/usr/lib64/python2.7/site-packages/ovirtsdk4/__init__.py", line 889, in _check_content_type\n raise Error(msg)\nError: The response content type \'text/html; charset=iso-8859-1\' isn\'t the expected XML\nlago.prefix: INFO: * Collect artifacts: \x1b[0m\x1b[0m\nlago.prefix: INFO: \x1b[0m\x1b[0m\nlago.prefix: INFO: \x1b[0m\x1b[0m\nlago.prefix: INFO: \x1b[0m\x1b[0m\nlago.plugins.vm: DEBUG: Extracting scp://lago-hc-basic-suite-4-2-host1:/var/log to /dev/shm/ost/deployment-hc-basic-suite-4.2/default/test_logs/002_bootstrap.add_hosts-20181027173541/lago-hc-basic-suite-4-2-host1/_var_log\nlago.prefix: INFO: \x1b[0m\x1b[0m\nlago.plugins.vm: DEBUG: Extracting scp://lago-hc-basic-suite-4-2-host2:/var/log to /dev/shm/ost/deployment-hc-basic-suite-4.2/default/test_logs/002_bootstrap.add_hosts-20181027173541/lago-hc-basic-suite-4-2-host2/_var_log\nlago.ssh: DEBUG: start task:472384e9-de80-4adb-a02c-c246550ba54e:Get ssh client for lago-hc-basic-suite-4-2-host1:\nlago.plugins.vm: DEBUG: Extracting scp://lago-hc-basic-suite-4-2-host0:/var/log to /dev/shm/ost/deployment-hc-basic-suite-4.2/default/test_logs/002_bootstrap.add_hosts-20181027173541/lago-hc-basic-suite-4-2-host0/_var_log\nlago.ssh: DEBUG: start task:4d05d0a2-fd94-42ab-a732-b77ee0d4696c:Get ssh client for lago-hc-basic-suite-4-2-host2:\nlago.ssh: DEBUG: start task:d54107ff-847b-4113-be18-5283c742fc14:Get ssh client for lago-hc-basic-suite-4-2-engine:\nlago.ssh: DEBUG: start task:1559fbf0-f27e-4fb7-9a34-8378e89acebd:Get ssh client for lago-hc-basic-suite-4-2-host0:\nlago.ssh: DEBUG: end task:472384e9-de80-4adb-a02c-c246550ba54e:Get ssh client for lago-hc-basic-suite-4-2-host1:\nlago.ssh: DEBUG: end task:4d05d0a2-fd94-42ab-a732-b77ee0d4696c:Get ssh client for lago-hc-basic-suite-4-2-host2:\nlago.ssh: DEBUG: end task:1559fbf0-f27e-4fb7-9a34-8378e89acebd:Get ssh client for lago-hc-basic-suite-4-2-host0:\nlago.prefix: INFO: \x1b[32mSuccess\x1b[0m (in 0:00:01)\nlago.ssh: DEBUG: end task:d54107ff-847b-4113-be18-5283c742fc14:Get ssh client for lago-hc-basic-suite-4-2-engine:\nlago.plugins.vm: DEBUG: Extracting scp://lago-hc-basic-suite-4-2-engine:/var/log to /dev/shm/ost/deployment-hc-basic-suite-4.2/default/test_logs/002_bootstrap.add_hosts-20181027173541/lago-hc-basic-suite-4-2-engine/_var_log\nlago.ssh: DEBUG: start task:f91de10b-bc3a-4892-8cc8-df6df0daf34a:Get ssh client for lago-hc-basic-suite-4-2-engine:\nlago.prefix: INFO: \x1b[32mSuccess\x1b[0m (in 0:00:01)\nlago.ssh: DEBUG: end task:f91de10b-bc3a-4892-8cc8-df6df0daf34a:Get ssh client for lago-hc-basic-suite-4-2-engine:\nlago.prefix: INFO: \x1b[32mSuccess\x1b[0m (in 0:00:03)\nroot: ERROR: - [Thread-13] lago-hc-basic-suite-4-2-engine: \x1b[31mERROR\x1b[0m (in 0:00:05)\nlago.prefix: DEBUG: File "/usr/lib/python2.7/site-packages/lago/prefix.py", line 1524, in _collect_artifacts\n vm.collect_artifacts(path, ignore_nopath)\n File "/usr/lib/python2.7/site-packages/lago/plugins/vm.py", line 644, in collect_artifacts\n ignore_nopath=ignore_nopath\n File "/usr/lib/python2.7/site-packages/lago/plugins/vm.py", line 384, in extract_paths\n return self.provider.extract_paths(paths, *args, **kwargs)\n File "/usr/lib/python2.7/site-packages/lago/plugins/vm.py", line 249, in extract_paths\n self._extract_paths_scp(paths=paths, ignore_nopath=ignore_nopath)\n File "/usr/lib/python2.7/site-packages/lago/plugins/vm.py", line 83, in wrapper\n return func(self, *args, **kwargs)\n File "/usr/lib/python2.7/site-packages/lago/plugins/vm.py", line 269, in _extract_paths_scp\n propagate_fail=False\n File "/usr/lib/python2.7/site-packages/lago/plugins/vm.py", line 428, in copy_from\n local_path=local_path,\n File "/usr/lib/python2.7/site-packages/scp.py", line 125, in get\n self._recv_all()\n File "/usr/lib/python2.7/site-packages/scp.py", line 255, in _recv_all\n command[code](msg[1:])\n File "/usr/lib/python2.7/site-packages/scp.py", line 315, in _recv_file\n raise SCPException(msg[1:])\n\nlago.utils: ERROR: Error while running thread\nTraceback (most recent call last):\n File "/usr/lib/python2.7/site-packages/lago/utils.py", line 58, in _ret_via_queue\n queue.put({\'return\': func()})\n File "/usr/lib/python2.7/site-packages/lago/prefix.py", line 1524, in _collect_artifacts\n vm.collect_artifacts(path, ignore_nopath)\n File "/usr/lib/python2.7/site-packages/lago/plugins/vm.py", line 644, in collect_artifacts\n ignore_nopath=ignore_nopath\n File "/usr/lib/python2.7/site-packages/lago/plugins/vm.py", line 384, in extract_paths\n return self.provider.extract_paths(paths, *args, **kwargs)\n File "/usr/lib/python2.7/site-packages/lago/plugins/vm.py", line 249, in extract_paths\n self._extract_paths_scp(paths=paths, ignore_nopath=ignore_nopath)\n File "/usr/lib/python2.7/site-packages/lago/plugins/vm.py", line 83, in wrapper\n return func(self, *args, **kwargs)\n File "/usr/lib/python2.7/site-packages/lago/plugins/vm.py", line 269, in _extract_paths_scp\n propagate_fail=False\n File "/usr/lib/python2.7/site-packages/lago/plugins/vm.py", line 428, in copy_from\n local_path=local_path,\n File "/usr/lib/python2.7/site-packages/scp.py", line 125, in get\n self._recv_all()\n File "/usr/lib/python2.7/site-packages/scp.py", line 255, in _recv_all\n command[code](msg[1:])\n File "/usr/lib/python2.7/site-packages/scp.py", line 315, in _recv_file\n raise SCPException(msg[1:])\nSCPException: scp: /var/log/ovirt-engine/boot.log: Broken pipe\n\nroot: ERROR: * Collect artifacts: \x1b[31mERROR\x1b[0m (in 0:00:05)\nlago.prefix: DEBUG: File "/usr/lib/python2.7/site-packages/lago/log_utils.py", line 636, in wrapper\n return func(*args, **kwargs)\n File "/usr/lib/python2.7/site-packages/lago/prefix.py", line 1528, in collect_artifacts\n self.virt_env.get_vms().values(),\n File "/usr/lib/python2.7/site-packages/lago/utils.py", line 100, in invoke_in_parallel\n return vt.join_all()\n File "/usr/lib/python2.7/site-packages/lago/utils.py", line 58, in _ret_via_queue\n queue.put({\'return\': func()})\n File "/usr/lib/python2.7/site-packages/lago/prefix.py", line 1524, in _collect_artifacts\n vm.collect_artifacts(path, ignore_nopath)\n File "/usr/lib/python2.7/site-packages/lago/plugins/vm.py", line 644, in collect_artifacts\n ignore_nopath=ignore_nopath\n File "/usr/lib/python2.7/site-packages/lago/plugins/vm.py", line 384, in extract_paths\n return self.provider.extract_paths(paths, *args, **kwargs)\n File "/usr/lib/python2.7/site-packages/lago/plugins/vm.py", line 249, in extract_paths\n self._extract_paths_scp(paths=paths, ignore_nopath=ignore_nopath)\n File "/usr/lib/python2.7/site-packages/lago/plugins/vm.py", line 83, in wrapper\n return func(self, *args, **kwargs)\n File "/usr/lib/python2.7/site-packages/lago/plugins/vm.py", line 269, in _extract_paths_scp\n propagate_fail=False\n File "/usr/lib/python2.7/site-packages/lago/plugins/vm.py", line 428, in copy_from\n local_path=local_path,\n File "/usr/lib/python2.7/site-packages/scp.py", line 125, in get\n self._recv_all()\n File "/usr/lib/python2.7/site-packages/scp.py", line 255, in _recv_all\n command[code](msg[1:])\n File "/usr/lib/python2.7/site-packages/scp.py", line 315, in _recv_file\n raise SCPException(msg[1:])\n\n--------------------- >> end captured logging << ---------------------'

Project: http://jenkins.ovirt.org/job/ovirt-system-tests_hc-basic-suite-4.2/ Build: http://jenkins.ovirt.org/job/ovirt-system-tests_hc-basic-suite-4.2/604/ Build Number: 604 Build Status: Still Failing Triggered By: Started by timer ------------------------------------- Changes Since Last Success: ------------------------------------- Changes for Build #602 [Ondra Machacek] ansible-suite: Rename modules plural to singular Changes for Build #603 [Ondra Machacek] ansible-suite: Rename modules plural to singular Changes for Build #604 [Ondra Machacek] ansible-suite: Rename modules plural to singular ----------------- Failed Tests: ----------------- 1 tests failed. FAILED: 002_bootstrap.add_hosts Error Message: The response content type 'text/html; charset=iso-8859-1' isn't the expected XML -------------------- >> begin captured logging << -------------------- ovirtlago.testlib: ERROR: * Unhandled exception in <function _host_is_up_4 at 0x7fbcaf441578> Traceback (most recent call last): File "/usr/lib/python2.7/site-packages/ovirtlago/testlib.py", line 234, in assert_equals_within res = func() File "/home/jenkins/workspace/ovirt-system-tests_hc-basic-suite-4.2/ovirt-system-tests/hc-basic-suite-4.2/test-scenarios/002_bootstrap.py", line 254, in _host_is_up_4 host_obj = host_service.get() File "/usr/lib64/python2.7/site-packages/ovirtsdk4/services.py", line 37093, in get return self._internal_get(headers, query, wait) File "/usr/lib64/python2.7/site-packages/ovirtsdk4/service.py", line 211, in _internal_get return future.wait() if wait else future File "/usr/lib64/python2.7/site-packages/ovirtsdk4/service.py", line 55, in wait return self._code(response) File "/usr/lib64/python2.7/site-packages/ovirtsdk4/service.py", line 208, in callback self._check_fault(response) File "/usr/lib64/python2.7/site-packages/ovirtsdk4/service.py", line 130, in _check_fault body = self._internal_read_body(response) File "/usr/lib64/python2.7/site-packages/ovirtsdk4/service.py", line 316, in _internal_read_body self._connection.check_xml_content_type(response) File "/usr/lib64/python2.7/site-packages/ovirtsdk4/__init__.py", line 849, in check_xml_content_type response.headers File "/usr/lib64/python2.7/site-packages/ovirtsdk4/__init__.py", line 889, in _check_content_type raise Error(msg) Error: The response content type 'text/html; charset=iso-8859-1' isn't the expected XML --------------------- >> end captured logging << --------------------- Stack Trace: File "/usr/lib64/python2.7/unittest/case.py", line 369, in run testMethod() File "/usr/lib/python2.7/site-packages/nose/case.py", line 197, in runTest self.test(*self.arg) File "/usr/lib/python2.7/site-packages/ovirtlago/testlib.py", line 142, in wrapped_test test() File "/usr/lib/python2.7/site-packages/ovirtlago/testlib.py", line 60, in wrapper return func(get_test_prefix(), *args, **kwargs) File "/home/jenkins/workspace/ovirt-system-tests_hc-basic-suite-4.2/ovirt-system-tests/hc-basic-suite-4.2/test-scenarios/002_bootstrap.py", line 229, in add_hosts add_hosts_4(prefix) File "/home/jenkins/workspace/ovirt-system-tests_hc-basic-suite-4.2/ovirt-system-tests/hc-basic-suite-4.2/test-scenarios/002_bootstrap.py", line 273, in add_hosts_4 testlib.assert_true_within(_host_is_up_4, timeout=15*60) File "/usr/lib/python2.7/site-packages/ovirtlago/testlib.py", line 278, in assert_true_within assert_equals_within(func, True, timeout, allowed_exceptions) File "/usr/lib/python2.7/site-packages/ovirtlago/testlib.py", line 234, in assert_equals_within res = func() File "/home/jenkins/workspace/ovirt-system-tests_hc-basic-suite-4.2/ovirt-system-tests/hc-basic-suite-4.2/test-scenarios/002_bootstrap.py", line 254, in _host_is_up_4 host_obj = host_service.get() File "/usr/lib64/python2.7/site-packages/ovirtsdk4/services.py", line 37093, in get return self._internal_get(headers, query, wait) File "/usr/lib64/python2.7/site-packages/ovirtsdk4/service.py", line 211, in _internal_get return future.wait() if wait else future File "/usr/lib64/python2.7/site-packages/ovirtsdk4/service.py", line 55, in wait return self._code(response) File "/usr/lib64/python2.7/site-packages/ovirtsdk4/service.py", line 208, in callback self._check_fault(response) File "/usr/lib64/python2.7/site-packages/ovirtsdk4/service.py", line 130, in _check_fault body = self._internal_read_body(response) File "/usr/lib64/python2.7/site-packages/ovirtsdk4/service.py", line 316, in _internal_read_body self._connection.check_xml_content_type(response) File "/usr/lib64/python2.7/site-packages/ovirtsdk4/__init__.py", line 849, in check_xml_content_type response.headers File "/usr/lib64/python2.7/site-packages/ovirtsdk4/__init__.py", line 889, in _check_content_type raise Error(msg) 'The response content type \'text/html; charset=iso-8859-1\' isn\'t the expected XML\n-------------------- >> begin captured logging << --------------------\novirtlago.testlib: ERROR: * Unhandled exception in <function _host_is_up_4 at 0x7fbcaf441578>\nTraceback (most recent call last):\n File "/usr/lib/python2.7/site-packages/ovirtlago/testlib.py", line 234, in assert_equals_within\n res = func()\n File "/home/jenkins/workspace/ovirt-system-tests_hc-basic-suite-4.2/ovirt-system-tests/hc-basic-suite-4.2/test-scenarios/002_bootstrap.py", line 254, in _host_is_up_4\n host_obj = host_service.get()\n File "/usr/lib64/python2.7/site-packages/ovirtsdk4/services.py", line 37093, in get\n return self._internal_get(headers, query, wait)\n File "/usr/lib64/python2.7/site-packages/ovirtsdk4/service.py", line 211, in _internal_get\n return future.wait() if wait else future\n File "/usr/lib64/python2.7/site-packages/ovirtsdk4/service.py", line 55, in wait\n return self._code(response)\n File "/usr/lib64/python2.7/site-packages/ovirtsdk4/service.py", line 208, in callback\n self._check_fault(response)\n File "/usr/lib64/python2.7/site-packages/ovirtsdk4/service.py", line 130, in _check_fault\n body = self._internal_read_body(response)\n File "/usr/lib64/python2.7/site-packages/ovirtsdk4/service.py", line 316, in _internal_read_body\n self._connection.check_xml_content_type(response)\n File "/usr/lib64/python2.7/site-packages/ovirtsdk4/__init__.py", line 849, in check_xml_content_type\n response.headers\n File "/usr/lib64/python2.7/site-packages/ovirtsdk4/__init__.py", line 889, in _check_content_type\n raise Error(msg)\nError: The response content type \'text/html; charset=iso-8859-1\' isn\'t the expected XML\n--------------------- >> end captured logging << ---------------------'

Project: http://jenkins.ovirt.org/job/ovirt-system-tests_hc-basic-suite-4.2/ Build: http://jenkins.ovirt.org/job/ovirt-system-tests_hc-basic-suite-4.2/605/ Build Number: 605 Build Status: Fixed Triggered By: Started by timer ------------------------------------- Changes Since Last Success: ------------------------------------- Changes for Build #602 [Ondra Machacek] ansible-suite: Rename modules plural to singular Changes for Build #603 [Ondra Machacek] ansible-suite: Rename modules plural to singular Changes for Build #604 [Ondra Machacek] ansible-suite: Rename modules plural to singular Changes for Build #605 [Ondra Machacek] ansible-suite: Rename modules plural to singular ----------------- Failed Tests: ----------------- All tests passed
participants (1)
-
jenkins@jenkins.phx.ovirt.org