Build failed in Jenkins: ovirt_master_system-tests #200
by jenkins@jenkins.phx.ovirt.org
See <http://jenkins.ovirt.org/job/ovirt_master_system-tests/200/changes>
Changes:
[Yaniv Kaul] ovirt-system-tests: add export template test
------------------------------------------
[...truncated 550 lines...]
## took 2357 seconds
## rc = 1
##########################################################
##! ERROR vvvvvvvvvvvvvvvvvvvvvvvvvvvvvvvvvvvvvvvvv
##! Last 20 log enties: logs/mocker-fedora-23-x86_64.fc23.basic_suite_master.sh/basic_suite_master.sh.log
##!
current session does not belong to lago group.
@ Collect artifacts:
# [Thread-1] lago_basic_suite_master_storage:
# [Thread-2] lago_basic_suite_master_host0:
# [Thread-3] lago_basic_suite_master_engine:
# [Thread-4] lago_basic_suite_master_host1:
# [Thread-4] lago_basic_suite_master_host1: Success (in 0:00:15)
# [Thread-2] lago_basic_suite_master_host0: Success (in 0:00:15)
# [Thread-3] lago_basic_suite_master_engine: Success (in 0:00:16)
# [Thread-1] lago_basic_suite_master_storage: Success (in 0:00:16)
@ Collect artifacts: Success (in 0:00:16)
<http://jenkins.ovirt.org/job/ovirt_master_system-tests/ws/ovirt-system-tests>
@@@@ ERROR: Failed running <http://jenkins.ovirt.org/job/ovirt_master_system-tests/ws/ovirt-system-te...>
#########################
======== Cleaning up
----------- Cleaning with lago
----------- Cleaning with lago done
======== Cleanup done
Took 2200 seconds
===================================
##!
##! ERROR ^^^^^^^^^^^^^^^^^^^^^^^^^^^^^^^^^^^^^^^^^^
##!########################################################
##########################################################
Build step 'Execute shell' marked build as failure
Performing Post build task...
Match found for :.* : True
Logical operation result is TRUE
Running script : #!/bin/bash -xe
echo 'shell_scripts/system_tests.collect_logs.sh'
#
# Required jjb vars:
# version
#
VERSION=master
SUITE_TYPE=
WORKSPACE="$PWD"
OVIRT_SUITE="$SUITE_TYPE_suite_$VERSION"
TESTS_LOGS="$WORKSPACE/ovirt-system-tests/exported-artifacts"
rm -rf "$WORKSPACE/exported-artifacts"
mkdir -p "$WORKSPACE/exported-artifacts"
if [[ -d "$TESTS_LOGS" ]]; then
mv "$TESTS_LOGS/"* "$WORKSPACE/exported-artifacts/"
fi
[ovirt_master_system-tests] $ /bin/bash -xe /tmp/hudson1385215626701773087.sh
+ echo shell_scripts/system_tests.collect_logs.sh
shell_scripts/system_tests.collect_logs.sh
+ VERSION=master
+ SUITE_TYPE=
+ WORKSPACE=<http://jenkins.ovirt.org/job/ovirt_master_system-tests/ws/>
+ OVIRT_SUITE=master
+ TESTS_LOGS=<http://jenkins.ovirt.org/job/ovirt_master_system-tests/ws/ovirt-system-te...>
+ rm -rf <http://jenkins.ovirt.org/job/ovirt_master_system-tests/200/artifact/expor...>
+ mkdir -p <http://jenkins.ovirt.org/job/ovirt_master_system-tests/200/artifact/expor...>
+ [[ -d <http://jenkins.ovirt.org/job/ovirt_master_system-tests/ws/ovirt-system-te...> ]]
+ mv <http://jenkins.ovirt.org/job/ovirt_master_system-tests/ws/ovirt-system-te...> <http://jenkins.ovirt.org/job/ovirt_master_system-tests/ws/ovirt-system-te...> <http://jenkins.ovirt.org/job/ovirt_master_system-tests/ws/ovirt-system-te...> <http://jenkins.ovirt.org/job/ovirt_master_system-tests/ws/ovirt-system-te...> <http://jenkins.ovirt.org/job/ovirt_master_system-tests/200/artifact/expor...>
POST BUILD TASK : SUCCESS
END OF POST BUILD TASK : 0
Match found for :.* : True
Logical operation result is TRUE
Running script : #!/bin/bash -xe
echo "shell-scripts/mock_cleanup.sh"
shopt -s nullglob
WORKSPACE="$PWD"
# Make clear this is the cleanup, helps reading the jenkins logs
cat <<EOC
_______________________________________________________________________
#######################################################################
# #
# CLEANUP #
# #
#######################################################################
EOC
# Archive the logs, we want them anyway
logs=(
./*log
./*/logs
)
if [[ "$logs" ]]; then
tar cvzf exported-artifacts/logs.tgz "${logs[@]}"
rm -rf "${logs[@]}"
fi
# stop any processes running inside the chroot
failed=false
mock_confs=("$WORKSPACE"/*/mocker*)
# Clean current jobs mockroot if any
for mock_conf_file in "${mock_confs[@]}"; do
[[ "$mock_conf_file" ]] || continue
echo "Cleaning up mock $mock_conf"
mock_root="${mock_conf_file##*/}"
mock_root="${mock_root%.*}"
my_mock="/usr/bin/mock"
my_mock+=" --configdir=${mock_conf_file%/*}"
my_mock+=" --root=${mock_root}"
my_mock+=" --resultdir=$WORKSPACE"
#TODO: investigate why mock --clean fails to umount certain dirs sometimes,
#so we can use it instead of manually doing all this.
echo "Killing all mock orphan processes, if any."
$my_mock \
--orphanskill \
|| {
echo "ERROR: Failed to kill orphans on $chroot."
failed=true
}
mock_root="$(\
grep \
-Po "(?<=config_opts\['root'\] = ')[^']*" \
"$mock_conf_file" \
)" || :
[[ "$mock_root" ]] || continue
mounts=($(mount | awk '{print $3}' | grep "$mock_root")) || :
if [[ "$mounts" ]]; then
echo "Found mounted dirs inside the chroot $chroot. Trying to umount."
fi
for mount in "${mounts[@]}"; do
sudo umount --lazy "$mount" \
|| {
echo "ERROR: Failed to umount $mount."
failed=true
}
done
done
# Clean any leftover chroot from other jobs
for mock_root in /var/lib/mock/*; do
this_chroot_failed=false
mounts=($(mount | awk '{print $3}' | grep "$mock_root")) || :
if [[ "$mounts" ]]; then
echo "Found mounted dirs inside the chroot $mock_root." \
"Trying to umount."
fi
for mount in "${mounts[@]}"; do
sudo umount --lazy "$mount" \
|| {
echo "ERROR: Failed to umount $mount."
failed=true
this_chroot_failed=true
}
done
if ! $this_chroot_failed; then
sudo rm -rf "$mock_root"
fi
done
if $failed; then
echo "Aborting."
exit 1
fi
# remove mock system cache, we will setup proxies to do the caching and this
# takes lots of space between runs
shopt -u nullglob
sudo rm -Rf /var/cache/mock/*
# restore the permissions in the working dir, as sometimes it leaves files
# owned by root and then the 'cleanup workspace' from jenkins job fails to
# clean and breaks the jobs
sudo chown -R "$USER" "$WORKSPACE"
[ovirt_master_system-tests] $ /bin/bash -xe /tmp/hudson1618313201494295186.sh
+ echo shell-scripts/mock_cleanup.sh
shell-scripts/mock_cleanup.sh
+ shopt -s nullglob
+ WORKSPACE=<http://jenkins.ovirt.org/job/ovirt_master_system-tests/ws/>
+ cat
_______________________________________________________________________
#######################################################################
# #
# CLEANUP #
# #
#######################################################################
+ logs=(./*log ./*/logs)
+ [[ -n ./ovirt-system-tests/logs ]]
+ tar cvzf exported-artifacts/logs.tgz ./ovirt-system-tests/logs
./ovirt-system-tests/logs/
./ovirt-system-tests/logs/mocker-fedora-23-x86_64.fc23.basic_suite_master.sh/
./ovirt-system-tests/logs/mocker-fedora-23-x86_64.fc23.basic_suite_master.sh/basic_suite_master.sh.log
./ovirt-system-tests/logs/mocker-fedora-23-x86_64.fc23.clean_rpmdb/
./ovirt-system-tests/logs/mocker-fedora-23-x86_64.fc23.clean_rpmdb/stdout_stderr.log
./ovirt-system-tests/logs/mocker-fedora-23-x86_64.fc23.install_packages/
./ovirt-system-tests/logs/mocker-fedora-23-x86_64.fc23.install_packages/stdout_stderr.log
./ovirt-system-tests/logs/mocker-fedora-23-x86_64.fc23.install_packages/state.log
./ovirt-system-tests/logs/mocker-fedora-23-x86_64.fc23.install_packages/build.log
./ovirt-system-tests/logs/mocker-fedora-23-x86_64.fc23.install_packages/root.log
./ovirt-system-tests/logs/mocker-fedora-23-x86_64.fc23.init/
./ovirt-system-tests/logs/mocker-fedora-23-x86_64.fc23.init/stdout_stderr.log
./ovirt-system-tests/logs/mocker-fedora-23-x86_64.fc23.init/state.log
./ovirt-system-tests/logs/mocker-fedora-23-x86_64.fc23.init/build.log
./ovirt-system-tests/logs/mocker-fedora-23-x86_64.fc23.init/root.log
+ rm -rf ./ovirt-system-tests/logs
+ failed=false
+ mock_confs=("$WORKSPACE"/*/mocker*)
+ for mock_conf_file in '"${mock_confs[@]}"'
+ [[ -n <http://jenkins.ovirt.org/job/ovirt_master_system-tests/ws/ovirt-system-te...> ]]
+ echo 'Cleaning up mock '
Cleaning up mock
+ mock_root=mocker-fedora-23-x86_64.fc23.cfg
+ mock_root=mocker-fedora-23-x86_64.fc23
+ my_mock=/usr/bin/mock
+ my_mock+=' --configdir=<http://jenkins.ovirt.org/job/ovirt_master_system-tests/ws/ovirt-system-tests'>
+ my_mock+=' --root=mocker-fedora-23-x86_64.fc23'
+ my_mock+=' --resultdir=<http://jenkins.ovirt.org/job/ovirt_master_system-tests/ws/'>
+ echo 'Killing all mock orphan processes, if any.'
Killing all mock orphan processes, if any.
+ /usr/bin/mock --configdir=<http://jenkins.ovirt.org/job/ovirt_master_system-tests/ws/ovirt-system-tests> --root=mocker-fedora-23-x86_64.fc23 --resultdir=<http://jenkins.ovirt.org/job/ovirt_master_system-tests/ws/> --orphanskill
WARNING: Could not find required logging config file: <http://jenkins.ovirt.org/job/ovirt_master_system-tests/ws/ovirt-system-te....> Using default...
INFO: mock.py version 1.2.17 starting (python version = 3.4.3)...
Start: init plugins
INFO: selinux enabled
Finish: init plugins
Start: run
Finish: run
++ grep -Po '(?<=config_opts\['\''root'\''\] = '\'')[^'\'']*' <http://jenkins.ovirt.org/job/ovirt_master_system-tests/ws/ovirt-system-te...>
+ mock_root=fedora-23-x86_64-4ddbe48c8f8b7d8c2c3635b52313f04a
+ [[ -n fedora-23-x86_64-4ddbe48c8f8b7d8c2c3635b52313f04a ]]
+ mounts=($(mount | awk '{print $3}' | grep "$mock_root"))
++ mount
++ grep fedora-23-x86_64-4ddbe48c8f8b7d8c2c3635b52313f04a
++ awk '{print $3}'
+ :
+ [[ -n '' ]]
+ false
+ shopt -u nullglob
+ sudo rm -Rf /var/cache/mock/fedora-23-x86_64-4ddbe48c8f8b7d8c2c3635b52313f04a
+ sudo chown -R jenkins <http://jenkins.ovirt.org/job/ovirt_master_system-tests/ws/>
POST BUILD TASK : SUCCESS
END OF POST BUILD TASK : 1
Recording test results
Archiving artifacts
8 years, 4 months
Build failed in Jenkins: ovirt_3.6_system-tests #170
by jenkins@jenkins.phx.ovirt.org
See <http://jenkins.ovirt.org/job/ovirt_3.6_system-tests/170/changes>
Changes:
[Yaniv Kaul] ovirt-system-tests: add export template test
------------------------------------------
[...truncated 414 lines...]
##! ERROR vvvvvvvvvvvvvvvvvvvvvvvvvvvvvvvvvvvvvvvvv
##! Last 20 log enties: logs/mocker-fedora-23-x86_64.fc23.basic_suite_3.6.sh/basic_suite_3.6.sh.log
##!
self._send_output(message_body)
File "/usr/lib64/python2.7/httplib.py", line 897, in _send_output
self.send(msg)
File "/usr/lib64/python2.7/httplib.py", line 859, in send
self.connect()
File "/usr/lib64/python2.7/httplib.py", line 836, in connect
self.timeout, self.source_address)
File "/usr/lib64/python2.7/socket.py", line 557, in create_connection
for res in getaddrinfo(host, port, 0, SOCK_STREAM):
IOError: [Errno socket error] [Errno -5] No address associated with hostname
#########################
======== Cleaning up
----------- Cleaning with lago
----------- Cleaning with lago done
Lago cleanup did not work (that is ok), forcing libvirt
----------- Cleaning libvirt
----------- Cleaning libvirt Done
======== Cleanup done
Took 44 seconds
===================================
##!
##! ERROR ^^^^^^^^^^^^^^^^^^^^^^^^^^^^^^^^^^^^^^^^^^
##!########################################################
##########################################################
Build step 'Execute shell' marked build as failure
Performing Post build task...
Match found for :.* : True
Logical operation result is TRUE
Running script : #!/bin/bash -xe
echo 'shell_scripts/system_tests.collect_logs.sh'
#
# Required jjb vars:
# version
#
VERSION=3.6
SUITE_TYPE=
WORKSPACE="$PWD"
OVIRT_SUITE="$SUITE_TYPE_suite_$VERSION"
TESTS_LOGS="$WORKSPACE/ovirt-system-tests/exported-artifacts"
rm -rf "$WORKSPACE/exported-artifacts"
mkdir -p "$WORKSPACE/exported-artifacts"
if [[ -d "$TESTS_LOGS" ]]; then
mv "$TESTS_LOGS/"* "$WORKSPACE/exported-artifacts/"
fi
[ovirt_3.6_system-tests] $ /bin/bash -xe /tmp/hudson2874557450904361572.sh
+ echo shell_scripts/system_tests.collect_logs.sh
shell_scripts/system_tests.collect_logs.sh
+ VERSION=3.6
+ SUITE_TYPE=
+ WORKSPACE=<http://jenkins.ovirt.org/job/ovirt_3.6_system-tests/ws/>
+ OVIRT_SUITE=3.6
+ TESTS_LOGS=<http://jenkins.ovirt.org/job/ovirt_3.6_system-tests/ws/ovirt-system-tests...>
+ rm -rf <http://jenkins.ovirt.org/job/ovirt_3.6_system-tests/170/artifact/exported...>
+ mkdir -p <http://jenkins.ovirt.org/job/ovirt_3.6_system-tests/170/artifact/exported...>
+ [[ -d <http://jenkins.ovirt.org/job/ovirt_3.6_system-tests/ws/ovirt-system-tests...> ]]
+ mv '<http://jenkins.ovirt.org/job/ovirt_3.6_system-tests/ws/ovirt-system-tests...'> <http://jenkins.ovirt.org/job/ovirt_3.6_system-tests/170/artifact/exported...>
mv: cannot stat ‘<http://jenkins.ovirt.org/job/ovirt_3.6_system-tests/ws/ovirt-system-tests...>: No such file or directory
POST BUILD TASK : FAILURE
END OF POST BUILD TASK : 0
ESCALATE FAILED POST BUILD TASK TO JOB STATUS
Match found for :.* : True
Logical operation result is TRUE
Running script : #!/bin/bash -xe
echo "shell-scripts/mock_cleanup.sh"
shopt -s nullglob
WORKSPACE="$PWD"
# Make clear this is the cleanup, helps reading the jenkins logs
cat <<EOC
_______________________________________________________________________
#######################################################################
# #
# CLEANUP #
# #
#######################################################################
EOC
# Archive the logs, we want them anyway
logs=(
./*log
./*/logs
)
if [[ "$logs" ]]; then
tar cvzf exported-artifacts/logs.tgz "${logs[@]}"
rm -rf "${logs[@]}"
fi
# stop any processes running inside the chroot
failed=false
mock_confs=("$WORKSPACE"/*/mocker*)
# Clean current jobs mockroot if any
for mock_conf_file in "${mock_confs[@]}"; do
[[ "$mock_conf_file" ]] || continue
echo "Cleaning up mock $mock_conf"
mock_root="${mock_conf_file##*/}"
mock_root="${mock_root%.*}"
my_mock="/usr/bin/mock"
my_mock+=" --configdir=${mock_conf_file%/*}"
my_mock+=" --root=${mock_root}"
my_mock+=" --resultdir=$WORKSPACE"
#TODO: investigate why mock --clean fails to umount certain dirs sometimes,
#so we can use it instead of manually doing all this.
echo "Killing all mock orphan processes, if any."
$my_mock \
--orphanskill \
|| {
echo "ERROR: Failed to kill orphans on $chroot."
failed=true
}
mock_root="$(\
grep \
-Po "(?<=config_opts\['root'\] = ')[^']*" \
"$mock_conf_file" \
)" || :
[[ "$mock_root" ]] || continue
mounts=($(mount | awk '{print $3}' | grep "$mock_root")) || :
if [[ "$mounts" ]]; then
echo "Found mounted dirs inside the chroot $chroot. Trying to umount."
fi
for mount in "${mounts[@]}"; do
sudo umount --lazy "$mount" \
|| {
echo "ERROR: Failed to umount $mount."
failed=true
}
done
done
# Clean any leftover chroot from other jobs
for mock_root in /var/lib/mock/*; do
this_chroot_failed=false
mounts=($(mount | awk '{print $3}' | grep "$mock_root")) || :
if [[ "$mounts" ]]; then
echo "Found mounted dirs inside the chroot $mock_root." \
"Trying to umount."
fi
for mount in "${mounts[@]}"; do
sudo umount --lazy "$mount" \
|| {
echo "ERROR: Failed to umount $mount."
failed=true
this_chroot_failed=true
}
done
if ! $this_chroot_failed; then
sudo rm -rf "$mock_root"
fi
done
if $failed; then
echo "Aborting."
exit 1
fi
# remove mock system cache, we will setup proxies to do the caching and this
# takes lots of space between runs
shopt -u nullglob
sudo rm -Rf /var/cache/mock/*
# restore the permissions in the working dir, as sometimes it leaves files
# owned by root and then the 'cleanup workspace' from jenkins job fails to
# clean and breaks the jobs
sudo chown -R "$USER" "$WORKSPACE"
[ovirt_3.6_system-tests] $ /bin/bash -xe /tmp/hudson3950783012019729333.sh
+ echo shell-scripts/mock_cleanup.sh
shell-scripts/mock_cleanup.sh
+ shopt -s nullglob
+ WORKSPACE=<http://jenkins.ovirt.org/job/ovirt_3.6_system-tests/ws/>
+ cat
_______________________________________________________________________
#######################################################################
# #
# CLEANUP #
# #
#######################################################################
+ logs=(./*log ./*/logs)
+ [[ -n ./ovirt-system-tests/logs ]]
+ tar cvzf exported-artifacts/logs.tgz ./ovirt-system-tests/logs
./ovirt-system-tests/logs/
./ovirt-system-tests/logs/mocker-fedora-23-x86_64.fc23.install_packages/
./ovirt-system-tests/logs/mocker-fedora-23-x86_64.fc23.install_packages/state.log
./ovirt-system-tests/logs/mocker-fedora-23-x86_64.fc23.install_packages/build.log
./ovirt-system-tests/logs/mocker-fedora-23-x86_64.fc23.install_packages/stdout_stderr.log
./ovirt-system-tests/logs/mocker-fedora-23-x86_64.fc23.install_packages/root.log
./ovirt-system-tests/logs/mocker-fedora-23-x86_64.fc23.init/
./ovirt-system-tests/logs/mocker-fedora-23-x86_64.fc23.init/state.log
./ovirt-system-tests/logs/mocker-fedora-23-x86_64.fc23.init/build.log
./ovirt-system-tests/logs/mocker-fedora-23-x86_64.fc23.init/stdout_stderr.log
./ovirt-system-tests/logs/mocker-fedora-23-x86_64.fc23.init/root.log
./ovirt-system-tests/logs/mocker-fedora-23-x86_64.fc23.basic_suite_3.6.sh/
./ovirt-system-tests/logs/mocker-fedora-23-x86_64.fc23.basic_suite_3.6.sh/basic_suite_3.6.sh.log
./ovirt-system-tests/logs/mocker-fedora-23-x86_64.fc23.clean_rpmdb/
./ovirt-system-tests/logs/mocker-fedora-23-x86_64.fc23.clean_rpmdb/stdout_stderr.log
+ rm -rf ./ovirt-system-tests/logs
+ failed=false
+ mock_confs=("$WORKSPACE"/*/mocker*)
+ for mock_conf_file in '"${mock_confs[@]}"'
+ [[ -n <http://jenkins.ovirt.org/job/ovirt_3.6_system-tests/ws/ovirt-system-tests...> ]]
+ echo 'Cleaning up mock '
Cleaning up mock
+ mock_root=mocker-fedora-23-x86_64.fc23.cfg
+ mock_root=mocker-fedora-23-x86_64.fc23
+ my_mock=/usr/bin/mock
+ my_mock+=' --configdir=<http://jenkins.ovirt.org/job/ovirt_3.6_system-tests/ws/ovirt-system-tests'>
+ my_mock+=' --root=mocker-fedora-23-x86_64.fc23'
+ my_mock+=' --resultdir=<http://jenkins.ovirt.org/job/ovirt_3.6_system-tests/ws/'>
+ echo 'Killing all mock orphan processes, if any.'
Killing all mock orphan processes, if any.
+ /usr/bin/mock --configdir=<http://jenkins.ovirt.org/job/ovirt_3.6_system-tests/ws/ovirt-system-tests> --root=mocker-fedora-23-x86_64.fc23 --resultdir=<http://jenkins.ovirt.org/job/ovirt_3.6_system-tests/ws/> --orphanskill
WARNING: Could not find required logging config file: <http://jenkins.ovirt.org/job/ovirt_3.6_system-tests/ws/ovirt-system-tests....> Using default...
INFO: mock.py version 1.2.17 starting (python version = 3.4.3)...
Start: init plugins
INFO: selinux enabled
Finish: init plugins
Start: run
Finish: run
++ grep -Po '(?<=config_opts\['\''root'\''\] = '\'')[^'\'']*' <http://jenkins.ovirt.org/job/ovirt_3.6_system-tests/ws/ovirt-system-tests...>
+ mock_root=fedora-23-x86_64-ecdfd9c866cbf1a2d41342199fdb011f
+ [[ -n fedora-23-x86_64-ecdfd9c866cbf1a2d41342199fdb011f ]]
+ mounts=($(mount | awk '{print $3}' | grep "$mock_root"))
++ mount
++ awk '{print $3}'
++ grep fedora-23-x86_64-ecdfd9c866cbf1a2d41342199fdb011f
+ :
+ [[ -n '' ]]
+ false
+ shopt -u nullglob
+ sudo rm -Rf /var/cache/mock/fedora-23-x86_64-ecdfd9c866cbf1a2d41342199fdb011f
+ sudo chown -R jenkins <http://jenkins.ovirt.org/job/ovirt_3.6_system-tests/ws/>
POST BUILD TASK : SUCCESS
END OF POST BUILD TASK : 1
Recording test results
ERROR: Step ‘Publish JUnit test result report’ failed: No test report files were found. Configuration error?
Archiving artifacts
8 years, 4 months
Build failed in Jenkins: ovirt_4.0_system-tests #102
by jenkins@jenkins.phx.ovirt.org
See <http://jenkins.ovirt.org/job/ovirt_4.0_system-tests/102/>
------------------------------------------
Started by timer
Building remotely on ovirt-srv25.phx.ovirt.org (physical integ-tests fc23) in workspace <http://jenkins.ovirt.org/job/ovirt_4.0_system-tests/ws/>
Cloning the remote Git repository
Cloning repository git://gerrit.ovirt.org/ovirt-system-tests.git
> git init <http://jenkins.ovirt.org/job/ovirt_4.0_system-tests/ws/ovirt-system-tests> # timeout=10
Fetching upstream changes from git://gerrit.ovirt.org/ovirt-system-tests.git
> git --version # timeout=10
> git -c core.askpass=true fetch --tags --progress git://gerrit.ovirt.org/ovirt-system-tests.git +refs/heads/*:refs/remotes/origin/*
ERROR: Error cloning remote repo 'origin'
hudson.plugins.git.GitException: Command "git -c core.askpass=true fetch --tags --progress git://gerrit.ovirt.org/ovirt-system-tests.git +refs/heads/*:refs/remotes/origin/*" returned status code 128:
stdout:
stderr: fatal: Unable to look up gerrit.ovirt.org (port 9418) (No address associated with hostname)
at org.jenkinsci.plugins.gitclient.CliGitAPIImpl.launchCommandIn(CliGitAPIImpl.java:1640)
at org.jenkinsci.plugins.gitclient.CliGitAPIImpl.launchCommandWithCredentials(CliGitAPIImpl.java:1388)
at org.jenkinsci.plugins.gitclient.CliGitAPIImpl.access$300(CliGitAPIImpl.java:62)
at org.jenkinsci.plugins.gitclient.CliGitAPIImpl$1.execute(CliGitAPIImpl.java:313)
at org.jenkinsci.plugins.gitclient.CliGitAPIImpl$2.execute(CliGitAPIImpl.java:505)
at org.jenkinsci.plugins.gitclient.RemoteGitImpl$CommandInvocationHandler$1.call(RemoteGitImpl.java:152)
at org.jenkinsci.plugins.gitclient.RemoteGitImpl$CommandInvocationHandler$1.call(RemoteGitImpl.java:145)
at hudson.remoting.UserRequest.perform(UserRequest.java:120)
at hudson.remoting.UserRequest.perform(UserRequest.java:48)
at hudson.remoting.Request$2.run(Request.java:326)
at hudson.remoting.InterceptingExecutorService$1.call(InterceptingExecutorService.java:68)
at java.util.concurrent.FutureTask.run(FutureTask.java:266)
at java.util.concurrent.ThreadPoolExecutor.runWorker(ThreadPoolExecutor.java:1142)
at java.util.concurrent.ThreadPoolExecutor$Worker.run(ThreadPoolExecutor.java:617)
at java.lang.Thread.run(Thread.java:745)
at ......remote call to ovirt-srv25.phx.ovirt.org(Native Method)
at hudson.remoting.Channel.attachCallSiteStackTrace(Channel.java:1416)
at hudson.remoting.UserResponse.retrieve(UserRequest.java:220)
at hudson.remoting.Channel.call(Channel.java:781)
at org.jenkinsci.plugins.gitclient.RemoteGitImpl$CommandInvocationHandler.execute(RemoteGitImpl.java:145)
at sun.reflect.GeneratedMethodAccessor610.invoke(Unknown Source)
at sun.reflect.DelegatingMethodAccessorImpl.invoke(DelegatingMethodAccessorImpl.java:43)
at java.lang.reflect.Method.invoke(Method.java:606)
at org.jenkinsci.plugins.gitclient.RemoteGitImpl$CommandInvocationHandler.invoke(RemoteGitImpl.java:131)
at com.sun.proxy.$Proxy63.execute(Unknown Source)
at hudson.plugins.git.GitSCM.retrieveChanges(GitSCM.java:1013)
at hudson.plugins.git.GitSCM.checkout(GitSCM.java:1053)
at org.jenkinsci.plugins.multiplescms.MultiSCM.checkout(MultiSCM.java:129)
at hudson.scm.SCM.checkout(SCM.java:485)
at hudson.model.AbstractProject.checkout(AbstractProject.java:1269)
at hudson.model.AbstractBuild$AbstractBuildExecution.defaultCheckout(AbstractBuild.java:607)
at jenkins.scm.SCMCheckoutStrategy.checkout(SCMCheckoutStrategy.java:86)
at hudson.model.AbstractBuild$AbstractBuildExecution.run(AbstractBuild.java:529)
at hudson.model.Run.execute(Run.java:1738)
at hudson.model.FreeStyleBuild.run(FreeStyleBuild.java:43)
at hudson.model.ResourceController.execute(ResourceController.java:98)
at hudson.model.Executor.run(Executor.java:410)
ERROR: null
Performing Post build task...
Match found for :.* : True
Logical operation result is TRUE
Running script : #!/bin/bash -xe
echo 'shell_scripts/system_tests.collect_logs.sh'
#
# Required jjb vars:
# version
#
VERSION=4.0
SUITE_TYPE=
WORKSPACE="$PWD"
OVIRT_SUITE="$SUITE_TYPE_suite_$VERSION"
TESTS_LOGS="$WORKSPACE/ovirt-system-tests/exported-artifacts"
rm -rf "$WORKSPACE/exported-artifacts"
mkdir -p "$WORKSPACE/exported-artifacts"
if [[ -d "$TESTS_LOGS" ]]; then
mv "$TESTS_LOGS/"* "$WORKSPACE/exported-artifacts/"
fi
[ovirt_4.0_system-tests] $ /bin/bash -xe /tmp/hudson4977232774053135431.sh
+ echo shell_scripts/system_tests.collect_logs.sh
shell_scripts/system_tests.collect_logs.sh
+ VERSION=4.0
+ SUITE_TYPE=
+ WORKSPACE=<http://jenkins.ovirt.org/job/ovirt_4.0_system-tests/ws/>
+ OVIRT_SUITE=4.0
+ TESTS_LOGS=<http://jenkins.ovirt.org/job/ovirt_4.0_system-tests/ws/ovirt-system-tests...>
+ rm -rf <http://jenkins.ovirt.org/job/ovirt_4.0_system-tests/102/artifact/exported...>
+ mkdir -p <http://jenkins.ovirt.org/job/ovirt_4.0_system-tests/102/artifact/exported...>
+ [[ -d <http://jenkins.ovirt.org/job/ovirt_4.0_system-tests/ws/ovirt-system-tests...> ]]
POST BUILD TASK : SUCCESS
END OF POST BUILD TASK : 0
Match found for :.* : True
Logical operation result is TRUE
Running script : #!/bin/bash -xe
echo "shell-scripts/mock_cleanup.sh"
shopt -s nullglob
WORKSPACE="$PWD"
# Make clear this is the cleanup, helps reading the jenkins logs
cat <<EOC
_______________________________________________________________________
#######################################################################
# #
# CLEANUP #
# #
#######################################################################
EOC
# Archive the logs, we want them anyway
logs=(
./*log
./*/logs
)
if [[ "$logs" ]]; then
tar cvzf exported-artifacts/logs.tgz "${logs[@]}"
rm -rf "${logs[@]}"
fi
# stop any processes running inside the chroot
failed=false
mock_confs=("$WORKSPACE"/*/mocker*)
# Clean current jobs mockroot if any
for mock_conf_file in "${mock_confs[@]}"; do
[[ "$mock_conf_file" ]] || continue
echo "Cleaning up mock $mock_conf"
mock_root="${mock_conf_file##*/}"
mock_root="${mock_root%.*}"
my_mock="/usr/bin/mock"
my_mock+=" --configdir=${mock_conf_file%/*}"
my_mock+=" --root=${mock_root}"
my_mock+=" --resultdir=$WORKSPACE"
#TODO: investigate why mock --clean fails to umount certain dirs sometimes,
#so we can use it instead of manually doing all this.
echo "Killing all mock orphan processes, if any."
$my_mock \
--orphanskill \
|| {
echo "ERROR: Failed to kill orphans on $chroot."
failed=true
}
mock_root="$(\
grep \
-Po "(?<=config_opts\['root'\] = ')[^']*" \
"$mock_conf_file" \
)" || :
[[ "$mock_root" ]] || continue
mounts=($(mount | awk '{print $3}' | grep "$mock_root")) || :
if [[ "$mounts" ]]; then
echo "Found mounted dirs inside the chroot $chroot. Trying to umount."
fi
for mount in "${mounts[@]}"; do
sudo umount --lazy "$mount" \
|| {
echo "ERROR: Failed to umount $mount."
failed=true
}
done
done
# Clean any leftover chroot from other jobs
for mock_root in /var/lib/mock/*; do
this_chroot_failed=false
mounts=($(mount | awk '{print $3}' | grep "$mock_root")) || :
if [[ "$mounts" ]]; then
echo "Found mounted dirs inside the chroot $mock_root." \
"Trying to umount."
fi
for mount in "${mounts[@]}"; do
sudo umount --lazy "$mount" \
|| {
echo "ERROR: Failed to umount $mount."
failed=true
this_chroot_failed=true
}
done
if ! $this_chroot_failed; then
sudo rm -rf "$mock_root"
fi
done
if $failed; then
echo "Aborting."
exit 1
fi
# remove mock system cache, we will setup proxies to do the caching and this
# takes lots of space between runs
shopt -u nullglob
sudo rm -Rf /var/cache/mock/*
# restore the permissions in the working dir, as sometimes it leaves files
# owned by root and then the 'cleanup workspace' from jenkins job fails to
# clean and breaks the jobs
sudo chown -R "$USER" "$WORKSPACE"
[ovirt_4.0_system-tests] $ /bin/bash -xe /tmp/hudson2390414190924585376.sh
+ echo shell-scripts/mock_cleanup.sh
shell-scripts/mock_cleanup.sh
+ shopt -s nullglob
+ WORKSPACE=<http://jenkins.ovirt.org/job/ovirt_4.0_system-tests/ws/>
+ cat
_______________________________________________________________________
#######################################################################
# #
# CLEANUP #
# #
#######################################################################
+ logs=(./*log ./*/logs)
+ [[ -n '' ]]
+ failed=false
+ mock_confs=("$WORKSPACE"/*/mocker*)
+ false
+ shopt -u nullglob
+ sudo rm -Rf '/var/cache/mock/*'
+ sudo chown -R jenkins <http://jenkins.ovirt.org/job/ovirt_4.0_system-tests/ws/>
POST BUILD TASK : SUCCESS
END OF POST BUILD TASK : 1
Recording test results
ERROR: Step ‘Publish JUnit test result report’ failed: No test report files were found. Configuration error?
Archiving artifacts
8 years, 4 months