[oVirt Jenkins] ovirt-system-tests_hc-basic-suite-master - Build #
861 - Failure!
by jenkins@jenkins.phx.ovirt.org
Project: http://jenkins.ovirt.org/job/ovirt-system-tests_hc-basic-suite-master/
Build: http://jenkins.ovirt.org/job/ovirt-system-tests_hc-basic-suite-master/861/
Build Number: 861
Build Status: Failure
Triggered By: Started by timer
-------------------------------------
Changes Since Last Success:
-------------------------------------
Changes for Build #861
[Eitan Raviv] networking: sync networks across cluster
-----------------
Failed Tests:
-----------------
1 tests failed.
FAILED: 002_bootstrap.add_hosts
Error Message:
The response content type 'text/html; charset=iso-8859-1' isn't the expected XML
-------------------- >> begin captured logging << --------------------
ovirtlago.testlib: ERROR: * Unhandled exception in <function _host_is_up_4 at 0x7f28df143320>
Traceback (most recent call last):
File "/usr/lib/python2.7/site-packages/ovirtlago/testlib.py", line 234, in assert_equals_within
res = func()
File "/home/jenkins/workspace/ovirt-system-tests_hc-basic-suite-master/ovirt-system-tests/hc-basic-suite-master/test-scenarios/002_bootstrap.py", line 253, in _host_is_up_4
host_obj = host_service.get()
File "/usr/lib64/python2.7/site-packages/ovirtsdk4/services.py", line 38639, in get
return self._internal_get(headers, query, wait)
File "/usr/lib64/python2.7/site-packages/ovirtsdk4/service.py", line 211, in _internal_get
return future.wait() if wait else future
File "/usr/lib64/python2.7/site-packages/ovirtsdk4/service.py", line 55, in wait
return self._code(response)
File "/usr/lib64/python2.7/site-packages/ovirtsdk4/service.py", line 208, in callback
self._check_fault(response)
File "/usr/lib64/python2.7/site-packages/ovirtsdk4/service.py", line 130, in _check_fault
body = self._internal_read_body(response)
File "/usr/lib64/python2.7/site-packages/ovirtsdk4/service.py", line 316, in _internal_read_body
self._connection.check_xml_content_type(response)
File "/usr/lib64/python2.7/site-packages/ovirtsdk4/__init__.py", line 850, in check_xml_content_type
response.headers
File "/usr/lib64/python2.7/site-packages/ovirtsdk4/__init__.py", line 890, in _check_content_type
raise Error(msg)
Error: The response content type 'text/html; charset=iso-8859-1' isn't the expected XML
--------------------- >> end captured logging << ---------------------
Stack Trace:
File "/usr/lib64/python2.7/unittest/case.py", line 369, in run
testMethod()
File "/usr/lib/python2.7/site-packages/nose/case.py", line 197, in runTest
self.test(*self.arg)
File "/usr/lib/python2.7/site-packages/ovirtlago/testlib.py", line 142, in wrapped_test
test()
File "/usr/lib/python2.7/site-packages/ovirtlago/testlib.py", line 60, in wrapper
return func(get_test_prefix(), *args, **kwargs)
File "/home/jenkins/workspace/ovirt-system-tests_hc-basic-suite-master/ovirt-system-tests/hc-basic-suite-master/test-scenarios/002_bootstrap.py", line 228, in add_hosts
add_hosts_4(prefix)
File "/home/jenkins/workspace/ovirt-system-tests_hc-basic-suite-master/ovirt-system-tests/hc-basic-suite-master/test-scenarios/002_bootstrap.py", line 275, in add_hosts_4
testlib.assert_true_within(_host_is_up_4, timeout=15*60)
File "/usr/lib/python2.7/site-packages/ovirtlago/testlib.py", line 278, in assert_true_within
assert_equals_within(func, True, timeout, allowed_exceptions)
File "/usr/lib/python2.7/site-packages/ovirtlago/testlib.py", line 234, in assert_equals_within
res = func()
File "/home/jenkins/workspace/ovirt-system-tests_hc-basic-suite-master/ovirt-system-tests/hc-basic-suite-master/test-scenarios/002_bootstrap.py", line 253, in _host_is_up_4
host_obj = host_service.get()
File "/usr/lib64/python2.7/site-packages/ovirtsdk4/services.py", line 38639, in get
return self._internal_get(headers, query, wait)
File "/usr/lib64/python2.7/site-packages/ovirtsdk4/service.py", line 211, in _internal_get
return future.wait() if wait else future
File "/usr/lib64/python2.7/site-packages/ovirtsdk4/service.py", line 55, in wait
return self._code(response)
File "/usr/lib64/python2.7/site-packages/ovirtsdk4/service.py", line 208, in callback
self._check_fault(response)
File "/usr/lib64/python2.7/site-packages/ovirtsdk4/service.py", line 130, in _check_fault
body = self._internal_read_body(response)
File "/usr/lib64/python2.7/site-packages/ovirtsdk4/service.py", line 316, in _internal_read_body
self._connection.check_xml_content_type(response)
File "/usr/lib64/python2.7/site-packages/ovirtsdk4/__init__.py", line 850, in check_xml_content_type
response.headers
File "/usr/lib64/python2.7/site-packages/ovirtsdk4/__init__.py", line 890, in _check_content_type
raise Error(msg)
'The response content type \'text/html; charset=iso-8859-1\' isn\'t the expected XML\n-------------------- >> begin captured logging << --------------------\novirtlago.testlib: ERROR: * Unhandled exception in <function _host_is_up_4 at 0x7f28df143320>\nTraceback (most recent call last):\n File "/usr/lib/python2.7/site-packages/ovirtlago/testlib.py", line 234, in assert_equals_within\n res = func()\n File "/home/jenkins/workspace/ovirt-system-tests_hc-basic-suite-master/ovirt-system-tests/hc-basic-suite-master/test-scenarios/002_bootstrap.py", line 253, in _host_is_up_4\n host_obj = host_service.get()\n File "/usr/lib64/python2.7/site-packages/ovirtsdk4/services.py", line 38639, in get\n return self._internal_get(headers, query, wait)\n File "/usr/lib64/python2.7/site-packages/ovirtsdk4/service.py", line 211, in _internal_get\n return future.wait() if wait else future\n File "/usr/lib64/python2.7/site-packages/ovirtsdk4/service.py", line 55, in wait\n return self._code(response)\n File "/usr/lib64/python2.7/site-packages/ovirtsdk4/service.py", line 208, in callback\n self._check_fault(response)\n File "/usr/lib64/python2.7/site-packages/ovirtsdk4/service.py", line 130, in _check_fault\n body = self._internal_read_body(response)\n File "/usr/lib64/python2.7/site-packages/ovirtsdk4/service.py", line 316, in _internal_read_body\n self._connection.check_xml_content_type(response)\n File "/usr/lib64/python2.7/site-packages/ovirtsdk4/__init__.py", line 850, in check_xml_content_type\n response.headers\n File "/usr/lib64/python2.7/site-packages/ovirtsdk4/__init__.py", line 890, in _check_content_type\n raise Error(msg)\nError: The response content type \'text/html; charset=iso-8859-1\' isn\'t the expected XML\n--------------------- >> end captured logging << ---------------------'
6 years, 4 months
[JIRA] (OVIRT-2572) ovirt-provider-ovn fails in 4.2 due to lago's
repolock
by Dafna Ron (oVirt JIRA)
[ https://ovirt-jira.atlassian.net/browse/OVIRT-2572?page=com.atlassian.jir... ]
Dafna Ron commented on OVIRT-2572:
----------------------------------
I am unable to ssh to the host so cannot clean the lock
dron@dron ~]$ ssh ovirt-srv21.phx.ovirt.org
ssh: connect to host ovirt-srv21.phx.ovirt.org port 22: Connection timed out
[dron@dron ~]$
> ovirt-provider-ovn fails in 4.2 due to lago's repolock
> ------------------------------------------------------
>
> Key: OVIRT-2572
> URL: https://ovirt-jira.atlassian.net/browse/OVIRT-2572
> Project: oVirt - virtualization made easy
> Issue Type: Bug
> Reporter: Dafna Ron
> Assignee: infra
> Labels: ost_failures, ost_infra
>
> build that failed: http://jenkins.ovirt.org/job/ovirt-4.2_change-queue-tester/3468/
> basic suite was running on ovirt-srv21.phx.ovirt.org
> {noformat}
> 10:33:23 [basic-suite.el7.x86_64] @ Create prefix internal repo: ERROR (in 0:03:00)
> 10:33:23 [basic-suite.el7.x86_64] Error occured, aborting
> 10:33:23 [basic-suite.el7.x86_64] Traceback (most recent call last):
> 10:33:23 [basic-suite.el7.x86_64] File "/usr/lib/python2.7/site-packages/ovirtlago/cmd.py", line 383, in do_run
> 10:33:23 [basic-suite.el7.x86_64] self.cli_plugins[args.ovirtverb].do_run(args)
> 10:33:23 [basic-suite.el7.x86_64] File "/usr/lib/python2.7/site-packages/lago/plugins/cli.py", line 184, in do_run
> 10:33:23 [basic-suite.el7.x86_64] self._do_run(**vars(args))
> 10:33:23 [basic-suite.el7.x86_64] File "/usr/lib/python2.7/site-packages/lago/utils.py", line 505, in wrapper
> 10:33:23 [basic-suite.el7.x86_64] return func(*args, **kwargs)
> 10:33:23 [basic-suite.el7.x86_64] File "/usr/lib/python2.7/site-packages/lago/utils.py", line 516, in wrapper
> 10:33:23 [basic-suite.el7.x86_64] return func(*args, prefix=prefix, **kwargs)
> 10:33:23 [basic-suite.el7.x86_64] File "/usr/lib/python2.7/site-packages/ovirtlago/cmd.py", line 173, in do_ovirt_reposetup
> 10:33:23 [basic-suite.el7.x86_64] sub_repo_name=repo_name
> 10:33:23 [basic-suite.el7.x86_64] File "/usr/lib/python2.7/site-packages/lago/log_utils.py", line 636, in wrapper
> 10:33:23 [basic-suite.el7.x86_64] return func(*args, **kwargs)
> 10:33:23 [basic-suite.el7.x86_64] File "/usr/lib/python2.7/site-packages/ovirtlago/prefix.py", line 203, in prepare_repo
> 10:33:23 [basic-suite.el7.x86_64] repos,
> 10:33:23 [basic-suite.el7.x86_64] File "/usr/lib/python2.7/site-packages/ovirtlago/reposetup.py", line 206, in sync_rpm_repository
> 10:33:23 [basic-suite.el7.x86_64] with LockFile(lock_path, timeout=180):
> 10:33:23 [basic-suite.el7.x86_64] File "/usr/lib/python2.7/site-packages/lago/utils.py", line 398, in __enter__
> 10:33:23 [basic-suite.el7.x86_64] self.timeout,
> 10:33:23 [basic-suite.el7.x86_64] TimerException: ('Unable to acquire lock for %s in %s secs', u'/var/lib/lago/repolock', 180)
> {noformat}
--
This message was sent by Atlassian Jira
(v1001.0.0-SNAPSHOT#100095)
6 years, 4 months
[JIRA] (OVIRT-2572) ovirt-provider-ovn fails in 4.2 due to lago's
repolock
by Dafna Ron (oVirt JIRA)
Dafna Ron created OVIRT-2572:
--------------------------------
Summary: ovirt-provider-ovn fails in 4.2 due to lago's repolock
Key: OVIRT-2572
URL: https://ovirt-jira.atlassian.net/browse/OVIRT-2572
Project: oVirt - virtualization made easy
Issue Type: Bug
Reporter: Dafna Ron
Assignee: infra
build that failed: http://jenkins.ovirt.org/job/ovirt-4.2_change-queue-tester/3468/
basic suite was running on ovirt-srv21.phx.ovirt.org
{noformat}
10:33:23 [basic-suite.el7.x86_64] @ Create prefix internal repo: ERROR (in 0:03:00)
10:33:23 [basic-suite.el7.x86_64] Error occured, aborting
10:33:23 [basic-suite.el7.x86_64] Traceback (most recent call last):
10:33:23 [basic-suite.el7.x86_64] File "/usr/lib/python2.7/site-packages/ovirtlago/cmd.py", line 383, in do_run
10:33:23 [basic-suite.el7.x86_64] self.cli_plugins[args.ovirtverb].do_run(args)
10:33:23 [basic-suite.el7.x86_64] File "/usr/lib/python2.7/site-packages/lago/plugins/cli.py", line 184, in do_run
10:33:23 [basic-suite.el7.x86_64] self._do_run(**vars(args))
10:33:23 [basic-suite.el7.x86_64] File "/usr/lib/python2.7/site-packages/lago/utils.py", line 505, in wrapper
10:33:23 [basic-suite.el7.x86_64] return func(*args, **kwargs)
10:33:23 [basic-suite.el7.x86_64] File "/usr/lib/python2.7/site-packages/lago/utils.py", line 516, in wrapper
10:33:23 [basic-suite.el7.x86_64] return func(*args, prefix=prefix, **kwargs)
10:33:23 [basic-suite.el7.x86_64] File "/usr/lib/python2.7/site-packages/ovirtlago/cmd.py", line 173, in do_ovirt_reposetup
10:33:23 [basic-suite.el7.x86_64] sub_repo_name=repo_name
10:33:23 [basic-suite.el7.x86_64] File "/usr/lib/python2.7/site-packages/lago/log_utils.py", line 636, in wrapper
10:33:23 [basic-suite.el7.x86_64] return func(*args, **kwargs)
10:33:23 [basic-suite.el7.x86_64] File "/usr/lib/python2.7/site-packages/ovirtlago/prefix.py", line 203, in prepare_repo
10:33:23 [basic-suite.el7.x86_64] repos,
10:33:23 [basic-suite.el7.x86_64] File "/usr/lib/python2.7/site-packages/ovirtlago/reposetup.py", line 206, in sync_rpm_repository
10:33:23 [basic-suite.el7.x86_64] with LockFile(lock_path, timeout=180):
10:33:23 [basic-suite.el7.x86_64] File "/usr/lib/python2.7/site-packages/lago/utils.py", line 398, in __enter__
10:33:23 [basic-suite.el7.x86_64] self.timeout,
10:33:23 [basic-suite.el7.x86_64] TimerException: ('Unable to acquire lock for %s in %s secs', u'/var/lib/lago/repolock', 180)
{noformat}
--
This message was sent by Atlassian Jira
(v1001.0.0-SNAPSHOT#100095)
6 years, 4 months
[oVirt Jenkins] ovirt-system-tests_he-node-ng-suite-master - Build
# 543 - Failure!
by jenkins@jenkins.phx.ovirt.org
Project: http://jenkins.ovirt.org/job/ovirt-system-tests_he-node-ng-suite-master/
Build: http://jenkins.ovirt.org/job/ovirt-system-tests_he-node-ng-suite-master/543/
Build Number: 543
Build Status: Failure
Triggered By: Started by timer
-------------------------------------
Changes Since Last Success:
-------------------------------------
Changes for Build #543
[Eitan Raviv] networking: sync networks across cluster
-----------------
Failed Tests:
-----------------
1 tests failed.
FAILED: 012_local_maintenance_sdk.local_maintenance
Error Message:
143
-------------------- >> begin captured logging << --------------------
root: INFO: * Waiting For System Stability...
cli: DEBUG: signal 15 was caught
--------------------- >> end captured logging << ---------------------
Stack Trace:
File "/usr/lib64/python2.7/unittest/case.py", line 369, in run
testMethod()
File "/usr/lib/python2.7/site-packages/nose/case.py", line 197, in runTest
self.test(*self.arg)
File "/usr/lib/python2.7/site-packages/ovirtlago/testlib.py", line 142, in wrapped_test
test()
File "/usr/lib/python2.7/site-packages/ovirtlago/testlib.py", line 60, in wrapper
return func(get_test_prefix(), *args, **kwargs)
File "/usr/lib/python2.7/site-packages/ovirtlago/testlib.py", line 79, in wrapper
prefix.virt_env.engine_vm().get_api(api_ver=4), *args, **kwargs
File "/usr/lib/python2.7/site-packages/ovirtlago/testlib.py", line 60, in wrapper
return func(get_test_prefix(), *args, **kwargs)
File "/home/jenkins/workspace/ovirt-system-tests_he-node-ng-suite-master/ovirt-system-tests/he-node-ng-suite-master/test-scenarios/012_local_maintenance_sdk.py", line 42, in local_maintenance
time.sleep(wait_value)
File "/usr/lib/python2.7/site-packages/lago/cmd.py", line 922, in exit_handler
sys.exit(128 + signum)
'143\n-------------------- >> begin captured logging << --------------------\nroot: INFO: * Waiting For System Stability...\ncli: DEBUG: signal 15 was caught\n--------------------- >> end captured logging << ---------------------'
6 years, 4 months