[oVirt Jenkins] ovirt-system-tests_he-node-ng-suite-master - Build
# 530 - Failure!
by jenkins@jenkins.phx.ovirt.org
Project: http://jenkins.ovirt.org/job/ovirt-system-tests_he-node-ng-suite-master/
Build: http://jenkins.ovirt.org/job/ovirt-system-tests_he-node-ng-suite-master/530/
Build Number: 530
Build Status: Failure
Triggered By: Started by timer
-------------------------------------
Changes Since Last Success:
-------------------------------------
Changes for Build #530
[Martin Perina] Fix notifier check in master and 4.2
[Evgheni Dereveanchin] Define Fedora 29 mirrors
-----------------
Failed Tests:
-----------------
1 tests failed.
FAILED: 012_local_maintenance_sdk.local_maintenance
Error Message:
143
-------------------- >> begin captured logging << --------------------
root: INFO: * Waiting For System Stability...
root: INFO: * Performing Deactivation...
root: INFO: * Performing Activation...
root: INFO: * Waiting For System Stability...
cli: DEBUG: signal 15 was caught
--------------------- >> end captured logging << ---------------------
Stack Trace:
File "/usr/lib64/python2.7/unittest/case.py", line 369, in run
testMethod()
File "/usr/lib/python2.7/site-packages/nose/case.py", line 197, in runTest
self.test(*self.arg)
File "/usr/lib/python2.7/site-packages/ovirtlago/testlib.py", line 142, in wrapped_test
test()
File "/usr/lib/python2.7/site-packages/ovirtlago/testlib.py", line 60, in wrapper
return func(get_test_prefix(), *args, **kwargs)
File "/usr/lib/python2.7/site-packages/ovirtlago/testlib.py", line 79, in wrapper
prefix.virt_env.engine_vm().get_api(api_ver=4), *args, **kwargs
File "/usr/lib/python2.7/site-packages/ovirtlago/testlib.py", line 60, in wrapper
return func(get_test_prefix(), *args, **kwargs)
File "/home/jenkins/workspace/ovirt-system-tests_he-node-ng-suite-master/ovirt-system-tests/he-node-ng-suite-master/test-scenarios/012_local_maintenance_sdk.py", line 79, in local_maintenance
time.sleep(wait_value)
File "/usr/lib/python2.7/site-packages/lago/cmd.py", line 922, in exit_handler
sys.exit(128 + signum)
'143\n-------------------- >> begin captured logging << --------------------\nroot: INFO: * Waiting For System Stability...\nroot: INFO: * Performing Deactivation...\nroot: INFO: * Performing Activation...\nroot: INFO: * Waiting For System Stability...\ncli: DEBUG: signal 15 was caught\n--------------------- >> end captured logging << ---------------------'
6 years, 4 months
[JIRA] (OVIRT-2542) several failures on host not being available -
possible networking issue
by Evgheni Dereveanchin (oVirt JIRA)
[ https://ovirt-jira.atlassian.net/browse/OVIRT-2542?page=com.atlassian.jir... ]
Evgheni Dereveanchin reassigned OVIRT-2542:
-------------------------------------------
Assignee: Evgheni Dereveanchin (was: infra)
> several failures on host not being available - possible networking issue
> -------------------------------------------------------------------------
>
> Key: OVIRT-2542
> URL: https://ovirt-jira.atlassian.net/browse/OVIRT-2542
> Project: oVirt - virtualization made easy
> Issue Type: Bug
> Reporter: Dafna Ron
> Assignee: Evgheni Dereveanchin
> Labels: ost_failures
>
> I have noticed that there are several issues that had failed recently with host not available.
> the changes are not directly related to the issue and I cannot see anything in engine to suggest that there is a problem.
> it could either be a network issue, a network test suite issue or infra related issue.
> I am opening this Jira so we can follow all the failures and see if we can find a common denominator
--
This message was sent by Atlassian Jira
(v1001.0.0-SNAPSHOT#100095)
6 years, 4 months
[JIRA] (OVIRT-2570) jenkins_standard-on-merge failing with
authentication errors
by Evgheni Dereveanchin (oVirt JIRA)
Evgheni Dereveanchin created OVIRT-2570:
-------------------------------------------
Summary: jenkins_standard-on-merge failing with authentication errors
Key: OVIRT-2570
URL: https://ovirt-jira.atlassian.net/browse/OVIRT-2570
Project: oVirt - virtualization made easy
Issue Type: Bug
Reporter: Evgheni Dereveanchin
Assignee: infra
Priority: High
The last couple of jobs failed so job configs are not being changed:
https://jenkins.ovirt.org/job/jenkins_standard-on-merge/
This is likely related to revocation of old access tokens in OVIRT-2557 as the error is:
jenkins.JenkinsException: Error in request. Possibly authentication failed [401]: Unauthorized
[~bkorren(a)redhat.com] where are jenkins access credentials stored for this job so that we can create a new token and update the job accordingly?
--
This message was sent by Atlassian Jira
(v1001.0.0-SNAPSHOT#100095)
6 years, 4 months
[ OST Failure Report ] [ oVirt Master (ovirt-engine) ] [ 05-11-2018 ]
[ 002_bootstrap.add_dc ]
by Dafna Ron
Hi,
We failed to add a DC due to computability level in the upgrade suite.
The upgrade suite is upgrading 4.2 to master.
Eli, can you please check if any fix is needed for upgrade?
Link and headline of suspected patches:
https://gerrit.ovirt.org/#/c/95190/ - engine: Remove Cluster Levels 3.6 and
4.0
Link to Job:
https://jenkins.ovirt.org/job/ovirt-master_change-queue-tester/10975
Link to all logs:
https://jenkins.ovirt.org/job/ovirt-master_change-queue-tester/10975/arti...
(Relevant) error snippet from the log:
<error>
2018-11-04 06:26:54,619-05 INFO
[org.ovirt.engine.core.dal.dbbroker.auditloghandling.AuditLogDirector]
(default task-1) [1d8362d9] EVENT_ID: USER_VDC_LOGIN(30), User
admin@internal-authz connecting from '192.168.201.1' using session
'v2y73+8hVB7ccwgjlAQOAK539eW6UsAysQQHbbiSy+mGDSTjOyZ38bpl9XLrGXSLJAqKyeXSdqfrbAqB4qWZUA=='
logged in.
2018-11-04 06:26:54,873-05 WARN
[org.ovirt.engine.core.bll.storage.pool.AddEmptyStoragePoolCommand]
(default task-1) [4b627395-5dd6-4211-a63e-d78f3728ec6f] Validation of
action 'AddEmptyStoragePool' failed for user admin@internal-authz. Reasons:
VAR__TYPE__STORAGE__POOL,VAR__ACTION__CREATE,ACTION_TYPE_FAILED_GIVEN_VERSION_NOT_SUPPORTED
2018-11-04 06:26:54,877-05 ERROR
[org.ovirt.engine.api.restapi.resource.AbstractBackendResource] (default
task-1) [] Operation Failed: [Cannot create Data Center. Selected
Compatibility Version is not supported.
</error>
6 years, 4 months