Build failed in Jenkins: system-sync_mirrors-epel-el6-x86_64 #2010
by jenkins@jenkins.phx.ovirt.org
See <http://jenkins.ovirt.org/job/system-sync_mirrors-epel-el6-x86_64/2010/dis...>
Changes:
[Barak Korren] Make STDCI V2 agnostic to wither you say 'please'
------------------------------------------
Started by timer
[EnvInject] - Loading node environment variables.
Building remotely on mirrors.phx.ovirt.org (mirrors) in workspace <http://jenkins.ovirt.org/job/system-sync_mirrors-epel-el6-x86_64/ws/>
> git rev-parse --is-inside-work-tree # timeout=10
Fetching changes from the remote Git repository
> git config remote.origin.url http://gerrit.ovirt.org/jenkins.git # timeout=10
Cleaning workspace
> git rev-parse --verify HEAD # timeout=10
Resetting working tree
> git reset --hard # timeout=10
> git clean -fdx # timeout=10
Pruning obsolete local branches
Fetching upstream changes from http://gerrit.ovirt.org/jenkins.git
> git --version # timeout=10
> git fetch --tags --progress http://gerrit.ovirt.org/jenkins.git +refs/heads/*:refs/remotes/origin/* --prune
> git rev-parse origin/master^{commit} # timeout=10
Checking out Revision 92dcff3964501e1dc1ff74f8f926acd28d52ef1e (origin/master)
> git config core.sparsecheckout # timeout=10
> git checkout -f 92dcff3964501e1dc1ff74f8f926acd28d52ef1e
Commit message: "Make STDCI V2 agnostic to wither you say 'please'"
> git rev-list --no-walk b41f91147d6d04e4ba87c7ad5d43cf4043d6a077 # timeout=10
[system-sync_mirrors-epel-el6-x86_64] $ /bin/bash -xe /tmp/jenkins3688213698153753568.sh
+ jenkins/scripts/mirror_mgr.sh resync_yum_mirror epel-el6 x86_64 jenkins/data/mirrors-reposync.conf
Checking if mirror needs a resync
Traceback (most recent call last):
File "/usr/bin/reposync", line 343, in <module>
main()
File "/usr/bin/reposync", line 209, in main
my.doSackSetup(arches)
File "/usr/lib/python2.7/site-packages/yum/__init__.py", line 741, in doSackSetup
return self._getSacks(archlist=archlist, thisrepo=thisrepo)
File "/usr/lib/python2.7/site-packages/yum/__init__.py", line 778, in _getSacks
self.repos.populateSack(which=repos)
File "/usr/lib/python2.7/site-packages/yum/repos.py", line 386, in populateSack
sack.populate(repo, mdtype, callback, cacheonly)
File "/usr/lib/python2.7/site-packages/yum/yumRepo.py", line 256, in populate
ret = misc.repo_gen_decompress(xml, gen, cached=repo.cache)
File "/usr/lib/python2.7/site-packages/yum/misc.py", line 1165, in repo_gen_decompress
return decompress(filename, dest=dest, check_timestamps=True)
File "/usr/lib/python2.7/site-packages/yum/misc.py", line 1150, in decompress
_decompress_chunked(filename, out, ztype)
File "/usr/lib/python2.7/site-packages/yum/misc.py", line 791, in _decompress_chunked
raise Errors.MiscError, msg
yum.Errors.MiscError: Error reading from file /home/jenkins/mirrors_cache/epel-el6/ba7e9800ccdc41af132d314c410438dd195d5ad994ba748b17a29e80810b1f88-primary.xml.gz: CRC check failed 0xf3280d82 != 0x5f1d0ef8L
Build step 'Execute shell' marked build as failure
6 years, 5 months
[oVirt Jenkins] ovirt-system-tests_hc-basic-suite-master - Build #
836 - Failure!
by jenkins@jenkins.phx.ovirt.org
Project: http://jenkins.ovirt.org/job/ovirt-system-tests_hc-basic-suite-master/
Build: http://jenkins.ovirt.org/job/ovirt-system-tests_hc-basic-suite-master/836/
Build Number: 836
Build Status: Failure
Triggered By: Started by timer
-------------------------------------
Changes Since Last Success:
-------------------------------------
Changes for Build #836
[Ales Musil] master: Update master suite compatibility version
-----------------
Failed Tests:
-----------------
1 tests failed.
FAILED: 002_bootstrap.add_hosts
Error Message:
The response content type 'text/html; charset=iso-8859-1' isn't the expected XML
-------------------- >> begin captured logging << --------------------
ovirtlago.testlib: ERROR: * Unhandled exception in <function _host_is_up_4 at 0x7f899b34b320>
Traceback (most recent call last):
File "/usr/lib/python2.7/site-packages/ovirtlago/testlib.py", line 234, in assert_equals_within
res = func()
File "/home/jenkins/workspace/ovirt-system-tests_hc-basic-suite-master/ovirt-system-tests/hc-basic-suite-master/test-scenarios/002_bootstrap.py", line 253, in _host_is_up_4
host_obj = host_service.get()
File "/usr/lib64/python2.7/site-packages/ovirtsdk4/services.py", line 38639, in get
return self._internal_get(headers, query, wait)
File "/usr/lib64/python2.7/site-packages/ovirtsdk4/service.py", line 211, in _internal_get
return future.wait() if wait else future
File "/usr/lib64/python2.7/site-packages/ovirtsdk4/service.py", line 55, in wait
return self._code(response)
File "/usr/lib64/python2.7/site-packages/ovirtsdk4/service.py", line 208, in callback
self._check_fault(response)
File "/usr/lib64/python2.7/site-packages/ovirtsdk4/service.py", line 130, in _check_fault
body = self._internal_read_body(response)
File "/usr/lib64/python2.7/site-packages/ovirtsdk4/service.py", line 316, in _internal_read_body
self._connection.check_xml_content_type(response)
File "/usr/lib64/python2.7/site-packages/ovirtsdk4/__init__.py", line 850, in check_xml_content_type
response.headers
File "/usr/lib64/python2.7/site-packages/ovirtsdk4/__init__.py", line 890, in _check_content_type
raise Error(msg)
Error: The response content type 'text/html; charset=iso-8859-1' isn't the expected XML
--------------------- >> end captured logging << ---------------------
Stack Trace:
File "/usr/lib64/python2.7/unittest/case.py", line 369, in run
testMethod()
File "/usr/lib/python2.7/site-packages/nose/case.py", line 197, in runTest
self.test(*self.arg)
File "/usr/lib/python2.7/site-packages/ovirtlago/testlib.py", line 142, in wrapped_test
test()
File "/usr/lib/python2.7/site-packages/ovirtlago/testlib.py", line 60, in wrapper
return func(get_test_prefix(), *args, **kwargs)
File "/home/jenkins/workspace/ovirt-system-tests_hc-basic-suite-master/ovirt-system-tests/hc-basic-suite-master/test-scenarios/002_bootstrap.py", line 228, in add_hosts
add_hosts_4(prefix)
File "/home/jenkins/workspace/ovirt-system-tests_hc-basic-suite-master/ovirt-system-tests/hc-basic-suite-master/test-scenarios/002_bootstrap.py", line 275, in add_hosts_4
testlib.assert_true_within(_host_is_up_4, timeout=15*60)
File "/usr/lib/python2.7/site-packages/ovirtlago/testlib.py", line 278, in assert_true_within
assert_equals_within(func, True, timeout, allowed_exceptions)
File "/usr/lib/python2.7/site-packages/ovirtlago/testlib.py", line 234, in assert_equals_within
res = func()
File "/home/jenkins/workspace/ovirt-system-tests_hc-basic-suite-master/ovirt-system-tests/hc-basic-suite-master/test-scenarios/002_bootstrap.py", line 253, in _host_is_up_4
host_obj = host_service.get()
File "/usr/lib64/python2.7/site-packages/ovirtsdk4/services.py", line 38639, in get
return self._internal_get(headers, query, wait)
File "/usr/lib64/python2.7/site-packages/ovirtsdk4/service.py", line 211, in _internal_get
return future.wait() if wait else future
File "/usr/lib64/python2.7/site-packages/ovirtsdk4/service.py", line 55, in wait
return self._code(response)
File "/usr/lib64/python2.7/site-packages/ovirtsdk4/service.py", line 208, in callback
self._check_fault(response)
File "/usr/lib64/python2.7/site-packages/ovirtsdk4/service.py", line 130, in _check_fault
body = self._internal_read_body(response)
File "/usr/lib64/python2.7/site-packages/ovirtsdk4/service.py", line 316, in _internal_read_body
self._connection.check_xml_content_type(response)
File "/usr/lib64/python2.7/site-packages/ovirtsdk4/__init__.py", line 850, in check_xml_content_type
response.headers
File "/usr/lib64/python2.7/site-packages/ovirtsdk4/__init__.py", line 890, in _check_content_type
raise Error(msg)
'The response content type \'text/html; charset=iso-8859-1\' isn\'t the expected XML\n-------------------- >> begin captured logging << --------------------\novirtlago.testlib: ERROR: * Unhandled exception in <function _host_is_up_4 at 0x7f899b34b320>\nTraceback (most recent call last):\n File "/usr/lib/python2.7/site-packages/ovirtlago/testlib.py", line 234, in assert_equals_within\n res = func()\n File "/home/jenkins/workspace/ovirt-system-tests_hc-basic-suite-master/ovirt-system-tests/hc-basic-suite-master/test-scenarios/002_bootstrap.py", line 253, in _host_is_up_4\n host_obj = host_service.get()\n File "/usr/lib64/python2.7/site-packages/ovirtsdk4/services.py", line 38639, in get\n return self._internal_get(headers, query, wait)\n File "/usr/lib64/python2.7/site-packages/ovirtsdk4/service.py", line 211, in _internal_get\n return future.wait() if wait else future\n File "/usr/lib64/python2.7/site-packages/ovirtsdk4/service.py", line 55, in wait\n return self._code(response)\n File "/usr/lib64/python2.7/site-packages/ovirtsdk4/service.py", line 208, in callback\n self._check_fault(response)\n File "/usr/lib64/python2.7/site-packages/ovirtsdk4/service.py", line 130, in _check_fault\n body = self._internal_read_body(response)\n File "/usr/lib64/python2.7/site-packages/ovirtsdk4/service.py", line 316, in _internal_read_body\n self._connection.check_xml_content_type(response)\n File "/usr/lib64/python2.7/site-packages/ovirtsdk4/__init__.py", line 850, in check_xml_content_type\n response.headers\n File "/usr/lib64/python2.7/site-packages/ovirtsdk4/__init__.py", line 890, in _check_content_type\n raise Error(msg)\nError: The response content type \'text/html; charset=iso-8859-1\' isn\'t the expected XML\n--------------------- >> end captured logging << ---------------------'
6 years, 5 months
Change in ds-jenkins-stg[master]: stdci agnostic test
by review@gerrit-staging.phx.ovirt.org
From Ehud Yonasi <eyonasi(a)redhat.com>:
Ehud Yonasi has posted comments on this change. ( https://gerrit-staging.phx.ovirt.org/219 )
Change subject: stdci agnostic test
......................................................................
Patch Set 1:
ci please re-merge
--
To view, visit https://gerrit-staging.phx.ovirt.org/219
To unsubscribe, visit https://gerrit-staging.phx.ovirt.org/settings
Gerrit-Project: ds-jenkins-stg
Gerrit-Branch: master
Gerrit-MessageType: comment
Gerrit-Change-Id: I99cd80a592c93dac6af364d6ddfcb53136d8a48a
Gerrit-Change-Number: 219
Gerrit-PatchSet: 1
Gerrit-Owner: Ehud Yonasi <eyonasi(a)redhat.com>
Gerrit-Reviewer: Ehud Yonasi <eyonasi(a)redhat.com>
Gerrit-Reviewer: Jenkins CI <infra(a)ovirt.org>
Gerrit-Comment-Date: Thu, 01 Nov 2018 15:26:22 +0000
Gerrit-HasComments: No
6 years, 5 months
Change in ds-jenkins-stg[master]: stdci agnostic test
by review@gerrit-staging.phx.ovirt.org
From Ehud Yonasi <eyonasi(a)redhat.com>:
Ehud Yonasi has posted comments on this change. ( https://gerrit-staging.phx.ovirt.org/219 )
Change subject: stdci agnostic test
......................................................................
Patch Set 1:
ci re-merge
--
To view, visit https://gerrit-staging.phx.ovirt.org/219
To unsubscribe, visit https://gerrit-staging.phx.ovirt.org/settings
Gerrit-Project: ds-jenkins-stg
Gerrit-Branch: master
Gerrit-MessageType: comment
Gerrit-Change-Id: I99cd80a592c93dac6af364d6ddfcb53136d8a48a
Gerrit-Change-Number: 219
Gerrit-PatchSet: 1
Gerrit-Owner: Ehud Yonasi <eyonasi(a)redhat.com>
Gerrit-Reviewer: Ehud Yonasi <eyonasi(a)redhat.com>
Gerrit-Reviewer: Jenkins CI <infra(a)ovirt.org>
Gerrit-Comment-Date: Thu, 01 Nov 2018 15:25:31 +0000
Gerrit-HasComments: No
6 years, 5 months
Change in ds-jenkins-stg[master]: stdci agnostic test
by review@gerrit-staging.phx.ovirt.org
From Ehud Yonasi <eyonasi(a)redhat.com>:
Ehud Yonasi has posted comments on this change. ( https://gerrit-staging.phx.ovirt.org/219 )
Change subject: stdci agnostic test
......................................................................
Patch Set 1:
ci re-merge
--
To view, visit https://gerrit-staging.phx.ovirt.org/219
To unsubscribe, visit https://gerrit-staging.phx.ovirt.org/settings
Gerrit-Project: ds-jenkins-stg
Gerrit-Branch: master
Gerrit-MessageType: comment
Gerrit-Change-Id: I99cd80a592c93dac6af364d6ddfcb53136d8a48a
Gerrit-Change-Number: 219
Gerrit-PatchSet: 1
Gerrit-Owner: Ehud Yonasi <eyonasi(a)redhat.com>
Gerrit-Reviewer: Ehud Yonasi <eyonasi(a)redhat.com>
Gerrit-Reviewer: Jenkins CI <infra(a)ovirt.org>
Gerrit-Comment-Date: Thu, 01 Nov 2018 15:16:17 +0000
Gerrit-HasComments: No
6 years, 5 months
Change in ds-jenkins-stg[master]: stdci agnostic test
by review@gerrit-staging.phx.ovirt.org
From Ehud Yonasi <eyonasi(a)redhat.com>:
Ehud Yonasi has posted comments on this change. ( https://gerrit-staging.phx.ovirt.org/219 )
Change subject: stdci agnostic test
......................................................................
Patch Set 1:
ci re-merge
--
To view, visit https://gerrit-staging.phx.ovirt.org/219
To unsubscribe, visit https://gerrit-staging.phx.ovirt.org/settings
Gerrit-Project: ds-jenkins-stg
Gerrit-Branch: master
Gerrit-MessageType: comment
Gerrit-Change-Id: I99cd80a592c93dac6af364d6ddfcb53136d8a48a
Gerrit-Change-Number: 219
Gerrit-PatchSet: 1
Gerrit-Owner: Ehud Yonasi <eyonasi(a)redhat.com>
Gerrit-Reviewer: Ehud Yonasi <eyonasi(a)redhat.com>
Gerrit-Reviewer: Jenkins CI <infra(a)ovirt.org>
Gerrit-Comment-Date: Thu, 01 Nov 2018 15:06:30 +0000
Gerrit-HasComments: No
6 years, 5 months
Change in ds-jenkins-stg[master]: stdci agnostic test
by review@gerrit-staging.phx.ovirt.org
From Ehud Yonasi <eyonasi(a)redhat.com>:
Ehud Yonasi has posted comments on this change. ( https://gerrit-staging.phx.ovirt.org/219 )
Change subject: stdci agnostic test
......................................................................
Patch Set 1:
ci re-merge
--
To view, visit https://gerrit-staging.phx.ovirt.org/219
To unsubscribe, visit https://gerrit-staging.phx.ovirt.org/settings
Gerrit-Project: ds-jenkins-stg
Gerrit-Branch: master
Gerrit-MessageType: comment
Gerrit-Change-Id: I99cd80a592c93dac6af364d6ddfcb53136d8a48a
Gerrit-Change-Number: 219
Gerrit-PatchSet: 1
Gerrit-Owner: Ehud Yonasi <eyonasi(a)redhat.com>
Gerrit-Reviewer: Ehud Yonasi <eyonasi(a)redhat.com>
Gerrit-Reviewer: Jenkins CI <infra(a)ovirt.org>
Gerrit-Comment-Date: Thu, 01 Nov 2018 15:05:11 +0000
Gerrit-HasComments: No
6 years, 5 months
Change in ds-jenkins-stg[master]: stdci agnostic test
by review@gerrit-staging.phx.ovirt.org
From Ehud Yonasi <eyonasi(a)redhat.com>:
Ehud Yonasi has posted comments on this change. ( https://gerrit-staging.phx.ovirt.org/219 )
Change subject: stdci agnostic test
......................................................................
Patch Set 1:
ci re-merge
--
To view, visit https://gerrit-staging.phx.ovirt.org/219
To unsubscribe, visit https://gerrit-staging.phx.ovirt.org/settings
Gerrit-Project: ds-jenkins-stg
Gerrit-Branch: master
Gerrit-MessageType: comment
Gerrit-Change-Id: I99cd80a592c93dac6af364d6ddfcb53136d8a48a
Gerrit-Change-Number: 219
Gerrit-PatchSet: 1
Gerrit-Owner: Ehud Yonasi <eyonasi(a)redhat.com>
Gerrit-Reviewer: Ehud Yonasi <eyonasi(a)redhat.com>
Gerrit-Reviewer: Jenkins CI <infra(a)ovirt.org>
Gerrit-Comment-Date: Thu, 01 Nov 2018 14:57:06 +0000
Gerrit-HasComments: No
6 years, 5 months
Change in ds-jenkins-stg[master]: stdci agnostic test
by review@gerrit-staging.phx.ovirt.org
From Ehud Yonasi <eyonasi(a)redhat.com>:
Ehud Yonasi has posted comments on this change. ( https://gerrit-staging.phx.ovirt.org/219 )
Change subject: stdci agnostic test
......................................................................
Patch Set 1:
ci re-merge please
--
To view, visit https://gerrit-staging.phx.ovirt.org/219
To unsubscribe, visit https://gerrit-staging.phx.ovirt.org/settings
Gerrit-Project: ds-jenkins-stg
Gerrit-Branch: master
Gerrit-MessageType: comment
Gerrit-Change-Id: I99cd80a592c93dac6af364d6ddfcb53136d8a48a
Gerrit-Change-Number: 219
Gerrit-PatchSet: 1
Gerrit-Owner: Ehud Yonasi <eyonasi(a)redhat.com>
Gerrit-Reviewer: Ehud Yonasi <eyonasi(a)redhat.com>
Gerrit-Reviewer: Jenkins CI <infra(a)ovirt.org>
Gerrit-Comment-Date: Thu, 01 Nov 2018 14:52:25 +0000
Gerrit-HasComments: No
6 years, 5 months