[oVirt Jenkins] ovirt-system-tests_hc-basic-suite-master - Build # 234 - Failure!
by jenkins@jenkins.phx.ovirt.org
------=_Part_383_725808303.1521469561145
Content-Type: text/plain; charset=UTF-8
Content-Transfer-Encoding: quoted-printable
Project: http://jenkins.ovirt.org/job/ovirt-system-tests_hc-basic-suite-mas=
ter/=20
Build: http://jenkins.ovirt.org/job/ovirt-system-tests_hc-basic-suite-maste=
r/234/
Build Number: 234
Build Status: Failure
Triggered By: Started by timer
-------------------------------------
Changes Since Last Success:
-------------------------------------
Changes for Build #234
[Marcin Mirecki] network-suite-master: Make openstack_client_config fixture=
available to
[Daniel Belenky] Align standard-stage with normalized DSL output
[Daniel Belenky] Add python-pluggy to .packages
-----------------
Failed Tests:
-----------------
1 tests failed.
FAILED: 002_bootstrap.add_hosts
Error Message:
The response content type 'text/html; charset=3Diso-8859-1' isn't the expec=
ted XML
-------------------- >> begin captured logging << --------------------
ovirtlago.testlib: ERROR: * Unhandled exception in <function _host_is_u=
p_4 at 0x4da6398>
Traceback (most recent call last):
File "/usr/lib/python2.7/site-packages/ovirtlago/testlib.py", line 219, i=
n assert_equals_within
res =3D func()
File "/home/jenkins/workspace/ovirt-system-tests_hc-basic-suite-master/ov=
irt-system-tests/hc-basic-suite-master/test-scenarios/002_bootstrap.py", li=
ne 255, in _host_is_up_4
host_obj =3D host_service.get()
File "/usr/lib64/python2.7/site-packages/ovirtsdk4/services.py", line 363=
46, in get
return self._internal_get(headers, query, wait)
File "/usr/lib64/python2.7/site-packages/ovirtsdk4/service.py", line 211,=
in _internal_get
return future.wait() if wait else future
File "/usr/lib64/python2.7/site-packages/ovirtsdk4/service.py", line 55, =
in wait
return self._code(response)
File "/usr/lib64/python2.7/site-packages/ovirtsdk4/service.py", line 208,=
in callback
self._check_fault(response)
File "/usr/lib64/python2.7/site-packages/ovirtsdk4/service.py", line 130,=
in _check_fault
body =3D self._internal_read_body(response)
File "/usr/lib64/python2.7/site-packages/ovirtsdk4/service.py", line 316,=
in _internal_read_body
self._connection.check_xml_content_type(response)
File "/usr/lib64/python2.7/site-packages/ovirtsdk4/__init__.py", line 849=
, in check_xml_content_type
response.headers
File "/usr/lib64/python2.7/site-packages/ovirtsdk4/__init__.py", line 889=
, in _check_content_type
raise Error(msg)
Error: The response content type 'text/html; charset=3Diso-8859-1' isn't th=
e expected XML
--------------------- >> end captured logging << ---------------------
Stack Trace:
File "/usr/lib64/python2.7/unittest/case.py", line 369, in run
testMethod()
File "/usr/lib/python2.7/site-packages/nose/case.py", line 197, in runTes=
t
self.test(*self.arg)
File "/usr/lib/python2.7/site-packages/ovirtlago/testlib.py", line 129, i=
n wrapped_test
test()
File "/usr/lib/python2.7/site-packages/ovirtlago/testlib.py", line 59, in=
wrapper
return func(get_test_prefix(), *args, **kwargs)
File "/home/jenkins/workspace/ovirt-system-tests_hc-basic-suite-master/ov=
irt-system-tests/hc-basic-suite-master/test-scenarios/002_bootstrap.py", li=
ne 230, in add_hosts
add_hosts_4(prefix)
File "/home/jenkins/workspace/ovirt-system-tests_hc-basic-suite-master/ov=
irt-system-tests/hc-basic-suite-master/test-scenarios/002_bootstrap.py", li=
ne 274, in add_hosts_4
testlib.assert_true_within(_host_is_up_4, timeout=3D15*60)
File "/usr/lib/python2.7/site-packages/ovirtlago/testlib.py", line 263, i=
n assert_true_within
assert_equals_within(func, True, timeout, allowed_exceptions)
File "/usr/lib/python2.7/site-packages/ovirtlago/testlib.py", line 219, i=
n assert_equals_within
res =3D func()
File "/home/jenkins/workspace/ovirt-system-tests_hc-basic-suite-master/ov=
irt-system-tests/hc-basic-suite-master/test-scenarios/002_bootstrap.py", li=
ne 255, in _host_is_up_4
host_obj =3D host_service.get()
File "/usr/lib64/python2.7/site-packages/ovirtsdk4/services.py", line 363=
46, in get
return self._internal_get(headers, query, wait)
File "/usr/lib64/python2.7/site-packages/ovirtsdk4/service.py", line 211,=
in _internal_get
return future.wait() if wait else future
File "/usr/lib64/python2.7/site-packages/ovirtsdk4/service.py", line 55, =
in wait
return self._code(response)
File "/usr/lib64/python2.7/site-packages/ovirtsdk4/service.py", line 208,=
in callback
self._check_fault(response)
File "/usr/lib64/python2.7/site-packages/ovirtsdk4/service.py", line 130,=
in _check_fault
body =3D self._internal_read_body(response)
File "/usr/lib64/python2.7/site-packages/ovirtsdk4/service.py", line 316,=
in _internal_read_body
self._connection.check_xml_content_type(response)
File "/usr/lib64/python2.7/site-packages/ovirtsdk4/__init__.py", line 849=
, in check_xml_content_type
response.headers
File "/usr/lib64/python2.7/site-packages/ovirtsdk4/__init__.py", line 889=
, in _check_content_type
raise Error(msg)
'The response content type \'text/html; charset=3Diso-8859-1\' isn\'t the e=
xpected XML\n-------------------- >> begin captured logging << ------------=
--------\novirtlago.testlib: ERROR: * Unhandled exception in <function =
_host_is_up_4 at 0x4da6398>\nTraceback (most recent call last):\n File "/u=
sr/lib/python2.7/site-packages/ovirtlago/testlib.py", line 219, in assert_e=
quals_within\n res =3D func()\n File "/home/jenkins/workspace/ovirt-sys=
tem-tests_hc-basic-suite-master/ovirt-system-tests/hc-basic-suite-master/te=
st-scenarios/002_bootstrap.py", line 255, in _host_is_up_4\n host_obj =
=3D host_service.get()\n File "/usr/lib64/python2.7/site-packages/ovirtsdk=
4/services.py", line 36346, in get\n return self._internal_get(headers, =
query, wait)\n File "/usr/lib64/python2.7/site-packages/ovirtsdk4/service.=
py", line 211, in _internal_get\n return future.wait() if wait else futu=
re\n File "/usr/lib64/python2.7/site-packages/ovirtsdk4/service.py", line =
55, in wait\n return self._code(response)\n File "/usr/lib64/python2.7/=
site-packages/ovirtsdk4/service.py", line 208, in callback\n self._check=
_fault(response)\n File "/usr/lib64/python2.7/site-packages/ovirtsdk4/serv=
ice.py", line 130, in _check_fault\n body =3D self._internal_read_body(r=
esponse)\n File "/usr/lib64/python2.7/site-packages/ovirtsdk4/service.py",=
line 316, in _internal_read_body\n self._connection.check_xml_content_t=
ype(response)\n File "/usr/lib64/python2.7/site-packages/ovirtsdk4/__init_=
_.py", line 849, in check_xml_content_type\n response.headers\n File "/=
usr/lib64/python2.7/site-packages/ovirtsdk4/__init__.py", line 889, in _che=
ck_content_type\n raise Error(msg)\nError: The response content type \'t=
ext/html; charset=3Diso-8859-1\' isn\'t the expected XML\n-----------------=
---- >> end captured logging << ---------------------'
------=_Part_383_725808303.1521469561145--
6 years, 8 months
[oVirt Jenkins] ovirt-system-tests_hc-basic-suite-4.2 - Build # 19 - Failure!
by jenkins@jenkins.phx.ovirt.org
------=_Part_373_1594740022.1521451551138
Content-Type: text/plain; charset=UTF-8
Content-Transfer-Encoding: quoted-printable
Project: http://jenkins.ovirt.org/job/ovirt-system-tests_hc-basic-suite-4.2=
/=20
Build: http://jenkins.ovirt.org/job/ovirt-system-tests_hc-basic-suite-4.2/1=
9/
Build Number: 19
Build Status: Failure
Triggered By: Started by timer
-------------------------------------
Changes Since Last Success:
-------------------------------------
Changes for Build #19
[Martin Sivak] Cleanup of test code - next() replaced with any()
[Daniel Belenky] Align standard-stage with normalized DSL output
[Daniel Belenky] Add python-pluggy to .packages
-----------------
Failed Tests:
-----------------
1 tests failed.
FAILED: 002_bootstrap.add_hosts
Error Message:
The response content type 'text/html; charset=3Diso-8859-1' isn't the expec=
ted XML
-------------------- >> begin captured logging << --------------------
ovirtlago.testlib: ERROR: * Unhandled exception in <function _host_is_u=
p_4 at 0x3631ed8>
Traceback (most recent call last):
File "/usr/lib/python2.7/site-packages/ovirtlago/testlib.py", line 219, i=
n assert_equals_within
res =3D func()
File "/home/jenkins/workspace/ovirt-system-tests_hc-basic-suite-4.2/ovirt=
-system-tests/hc-basic-suite-4.2/test-scenarios/002_bootstrap.py", line 254=
, in _host_is_up_4
host_obj =3D host_service.get()
File "/usr/lib64/python2.7/site-packages/ovirtsdk4/services.py", line 362=
19, in get
return self._internal_get(headers, query, wait)
File "/usr/lib64/python2.7/site-packages/ovirtsdk4/service.py", line 211,=
in _internal_get
return future.wait() if wait else future
File "/usr/lib64/python2.7/site-packages/ovirtsdk4/service.py", line 55, =
in wait
return self._code(response)
File "/usr/lib64/python2.7/site-packages/ovirtsdk4/service.py", line 208,=
in callback
self._check_fault(response)
File "/usr/lib64/python2.7/site-packages/ovirtsdk4/service.py", line 130,=
in _check_fault
body =3D self._internal_read_body(response)
File "/usr/lib64/python2.7/site-packages/ovirtsdk4/service.py", line 316,=
in _internal_read_body
self._connection.check_xml_content_type(response)
File "/usr/lib64/python2.7/site-packages/ovirtsdk4/__init__.py", line 849=
, in check_xml_content_type
response.headers
File "/usr/lib64/python2.7/site-packages/ovirtsdk4/__init__.py", line 889=
, in _check_content_type
raise Error(msg)
Error: The response content type 'text/html; charset=3Diso-8859-1' isn't th=
e expected XML
--------------------- >> end captured logging << ---------------------
Stack Trace:
File "/usr/lib64/python2.7/unittest/case.py", line 369, in run
testMethod()
File "/usr/lib/python2.7/site-packages/nose/case.py", line 197, in runTes=
t
self.test(*self.arg)
File "/usr/lib/python2.7/site-packages/ovirtlago/testlib.py", line 129, i=
n wrapped_test
test()
File "/usr/lib/python2.7/site-packages/ovirtlago/testlib.py", line 59, in=
wrapper
return func(get_test_prefix(), *args, **kwargs)
File "/home/jenkins/workspace/ovirt-system-tests_hc-basic-suite-4.2/ovirt=
-system-tests/hc-basic-suite-4.2/test-scenarios/002_bootstrap.py", line 229=
, in add_hosts
add_hosts_4(prefix)
File "/home/jenkins/workspace/ovirt-system-tests_hc-basic-suite-4.2/ovirt=
-system-tests/hc-basic-suite-4.2/test-scenarios/002_bootstrap.py", line 273=
, in add_hosts_4
testlib.assert_true_within(_host_is_up_4, timeout=3D15*60)
File "/usr/lib/python2.7/site-packages/ovirtlago/testlib.py", line 263, i=
n assert_true_within
assert_equals_within(func, True, timeout, allowed_exceptions)
File "/usr/lib/python2.7/site-packages/ovirtlago/testlib.py", line 219, i=
n assert_equals_within
res =3D func()
File "/home/jenkins/workspace/ovirt-system-tests_hc-basic-suite-4.2/ovirt=
-system-tests/hc-basic-suite-4.2/test-scenarios/002_bootstrap.py", line 254=
, in _host_is_up_4
host_obj =3D host_service.get()
File "/usr/lib64/python2.7/site-packages/ovirtsdk4/services.py", line 362=
19, in get
return self._internal_get(headers, query, wait)
File "/usr/lib64/python2.7/site-packages/ovirtsdk4/service.py", line 211,=
in _internal_get
return future.wait() if wait else future
File "/usr/lib64/python2.7/site-packages/ovirtsdk4/service.py", line 55, =
in wait
return self._code(response)
File "/usr/lib64/python2.7/site-packages/ovirtsdk4/service.py", line 208,=
in callback
self._check_fault(response)
File "/usr/lib64/python2.7/site-packages/ovirtsdk4/service.py", line 130,=
in _check_fault
body =3D self._internal_read_body(response)
File "/usr/lib64/python2.7/site-packages/ovirtsdk4/service.py", line 316,=
in _internal_read_body
self._connection.check_xml_content_type(response)
File "/usr/lib64/python2.7/site-packages/ovirtsdk4/__init__.py", line 849=
, in check_xml_content_type
response.headers
File "/usr/lib64/python2.7/site-packages/ovirtsdk4/__init__.py", line 889=
, in _check_content_type
raise Error(msg)
'The response content type \'text/html; charset=3Diso-8859-1\' isn\'t the e=
xpected XML\n-------------------- >> begin captured logging << ------------=
--------\novirtlago.testlib: ERROR: * Unhandled exception in <function =
_host_is_up_4 at 0x3631ed8>\nTraceback (most recent call last):\n File "/u=
sr/lib/python2.7/site-packages/ovirtlago/testlib.py", line 219, in assert_e=
quals_within\n res =3D func()\n File "/home/jenkins/workspace/ovirt-sys=
tem-tests_hc-basic-suite-4.2/ovirt-system-tests/hc-basic-suite-4.2/test-sce=
narios/002_bootstrap.py", line 254, in _host_is_up_4\n host_obj =3D host=
_service.get()\n File "/usr/lib64/python2.7/site-packages/ovirtsdk4/servic=
es.py", line 36219, in get\n return self._internal_get(headers, query, w=
ait)\n File "/usr/lib64/python2.7/site-packages/ovirtsdk4/service.py", lin=
e 211, in _internal_get\n return future.wait() if wait else future\n Fi=
le "/usr/lib64/python2.7/site-packages/ovirtsdk4/service.py", line 55, in w=
ait\n return self._code(response)\n File "/usr/lib64/python2.7/site-pac=
kages/ovirtsdk4/service.py", line 208, in callback\n self._check_fault(r=
esponse)\n File "/usr/lib64/python2.7/site-packages/ovirtsdk4/service.py",=
line 130, in _check_fault\n body =3D self._internal_read_body(response)=
\n File "/usr/lib64/python2.7/site-packages/ovirtsdk4/service.py", line 31=
6, in _internal_read_body\n self._connection.check_xml_content_type(resp=
onse)\n File "/usr/lib64/python2.7/site-packages/ovirtsdk4/__init__.py", l=
ine 849, in check_xml_content_type\n response.headers\n File "/usr/lib6=
4/python2.7/site-packages/ovirtsdk4/__init__.py", line 889, in _check_conte=
nt_type\n raise Error(msg)\nError: The response content type \'text/html=
; charset=3Diso-8859-1\' isn\'t the expected XML\n--------------------- >> =
end captured logging << ---------------------'
------=_Part_373_1594740022.1521451551138--
6 years, 8 months